Build:
  1. 0
2026-09-28 15:19.23: New job: tool topkg.1.1.1+ox (147515bac51e)
2026-09-28 15:19.23: Waiting for resource in pool day11-builds
2026-09-28 15:20.07: Got resource from pool day11-builds
2026-09-28 15:20.07: [profile oxcaml-odoc-master] tool topkg.1.1.1+ox
2026-09-28 15:20.07: tool topkg.1.1.1+ox (147515bac51e)
=== DEPENDENCIES (6 transitive) ===
  compiler-cloning.enabled                           9ab6e8146b48
  ocaml.5.5.1                                        62cb7e73ffb1
  ocaml-base-compiler.5.5.1                          3187d6d6f452
  ocaml-compiler.5.5.1                               3af2e5d33cd9
  ocamlbuild.0.16.1+ox                               de28c56e9c81
  ocamlfind.1.9.8+ox                                 37a15b4b5fe5
=== STDOUT ===
Processing: [default: loading data]
[topkg.1.1.1+ox: dl]
[topkg.1.1.1+ox: extract]
-> retrieved topkg.1.1.1+ox  (https://opam.ocaml.org/cache)
[topkg: patch] applying topkg_string.patch
[topkg: ocaml build]
+ /home/opam/.opam/default/bin/ocaml "pkg/pkg.ml" "build" "--pkg-name" "topkg" "--dev-pkg" "false" (CWD=/home/opam/.opam/default/.opam-switch/build/topkg.1.1.1+ox)
- ocamlfind: [WARNING] Cannot read directory ../stublibs which is mentioned in ld.conf
- ocamlfind: [WARNING] Cannot read directory ./stublibs which is mentioned in ld.conf
- + ocamlfind ocamlc -config
- ocamlfind: [WARNING] Cannot read directory ../stublibs which is mentioned in ld.conf
- ocamlfind: [WARNING] Cannot read directory ./stublibs which is mentioned in ld.conf
- + ocamlfind ocamldep -modules src/topkg.ml > src/topkg.ml.depends
- + ocamlfind ocamldep -modules src/topkg.mli > src/topkg.mli.depends
- ocamlfind: [WARNING] Cannot read directory ../stublibs which is mentioned in ld.conf
- ocamlfind: [WARNING] Cannot read directory ./stublibs which is mentioned in ld.conf
- + ocamlfind ocamlc -c -g -bin-annot -safe-string -I src -I src-bin -I test -I src-care -o src/topkg.cmi src/topkg.mli
- + ocamlfind ocamlc -c -g -bin-annot -safe-string -I src -I src-bin -I test -I src-care -o src/topkg.cmi src/topkg.mli
- ocamlfind: [WARNING] Cannot read directory ../stublibs which is mentioned in ld.conf
- ocamlfind: [WARNING] Cannot read directory ./stublibs which is mentioned in ld.conf
- + ocamlfind ocamldep -modules src/topkg_build.ml > src/topkg_build.ml.depends
- + ocamlfind ocamldep -modules src/topkg_build.mli > src/topkg_build.mli.depends
- + ocamlfind ocamldep -modules src/topkg_cmd.mli > src/topkg_cmd.mli.depends
- + ocamlfind ocamldep -modules src/topkg_fpath.mli > src/topkg_fpath.mli.depends
- + ocamlfind ocamlc -c -g -bin-annot -safe-string -I src -I src-bin -I test -I src-care -o src/topkg_fpath.cmi src/topkg_fpath.mli
- + ocamlfind ocamlc -c -g -bin-annot -safe-string -I src -I src-bin -I test -I src-care -o src/topkg_fpath.cmi src/topkg_fpath.mli
- ocamlfind: [WARNING] Cannot read directory ../stublibs which is mentioned in ld.conf
- ocamlfind: [WARNING] Cannot read directory ./stublibs which is mentioned in ld.conf
- + ocamlfind ocamldep -modules src/topkg_codec.mli > src/topkg_codec.mli.depends
- + ocamlfind ocamlc -c -g -bin-annot -safe-string -I src -I src-bin -I test -I src-care -o src/topkg_cmd.cmi src/topkg_cmd.mli
- + ocamlfind ocamlc -c -g -bin-annot -safe-string -I src -I src-bin -I test -I src-care -o src/topkg_cmd.cmi src/topkg_cmd.mli
- ocamlfind: [WARNING] Cannot read directory ../stublibs which is mentioned in ld.conf
- ocamlfind: [WARNING] Cannot read directory ./stublibs which is mentioned in ld.conf
- + ocamlfind ocamldep -modules src/topkg_result.mli > src/topkg_result.mli.depends
- + ocamlfind ocamlc -c -g -bin-annot -safe-string -I src -I src-bin -I test -I src-care -o src/topkg_result.cmi src/topkg_result.mli
- + ocamlfind ocamlc -c -g -bin-annot -safe-string -I src -I src-bin -I test -I src-care -o src/topkg_result.cmi src/topkg_result.mli
- ocamlfind: [WARNING] Cannot read directory ../stublibs which is mentioned in ld.conf
- ocamlfind: [WARNING] Cannot read directory ./stublibs which is mentioned in ld.conf
- + ocamlfind ocamldep -modules src/topkg_conf.mli > src/topkg_conf.mli.depends
- + ocamlfind ocamlc -c -g -bin-annot -safe-string -I src -I src-bin -I test -I src-care -o src/topkg_codec.cmi src/topkg_codec.mli
- + ocamlfind ocamlc -c -g -bin-annot -safe-string -I src -I src-bin -I test -I src-care -o src/topkg_conf.cmi src/topkg_conf.mli
- + ocamlfind ocamlc -c -g -bin-annot -safe-string -I src -I src-bin -I test -I src-care -o src/topkg_codec.cmi src/topkg_codec.mli
- ocamlfind: [WARNING] Cannot read directory ../stublibs which is mentioned in ld.conf
- ocamlfind: [WARNING] Cannot read directory ./stublibs which is mentioned in ld.conf
- + ocamlfind ocamlc -c -g -bin-annot -safe-string -I src -I src-bin -I test -I src-care -o src/topkg_conf.cmi src/topkg_conf.mli
- ocamlfind: [WARNING] Cannot read directory ../stublibs which is mentioned in ld.conf
- ocamlfind: [WARNING] Cannot read directory ./stublibs which is mentioned in ld.conf
- + ocamlfind ocamlc -c -g -bin-annot -safe-string -I src -I src-bin -I test -I src-care -o src/topkg_build.cmi src/topkg_build.mli
- + ocamlfind ocamlc -c -g -bin-annot -safe-string -I src -I src-bin -I test -I src-care -o src/topkg_build.cmi src/topkg_build.mli
- ocamlfind: [WARNING] Cannot read directory ../stublibs which is mentioned in ld.conf
- ocamlfind: [WARNING] Cannot read directory ./stublibs which is mentioned in ld.conf
- + ocamlfind ocamldep -modules src/topkg_cmd.ml > src/topkg_cmd.ml.depends
- + ocamlfind ocamldep -modules src/topkg_fpath.ml > src/topkg_fpath.ml.depends
- + ocamlfind ocamldep -modules src/topkg_string.ml > src/topkg_string.ml.depends
- + ocamlfind ocamldep -modules src/topkg_string.mli > src/topkg_string.mli.depends
- + ocamlfind ocamldep -modules src/topkg_string.mli > src/topkg_string.mli.depends
- File "src/topkg_string.mli", line 23, characters 28-30:
- 23 | val trim : string -> string @@ portable
-                                  ^^
- Error: Syntax error
- Command exited with code 2.
- pkg.ml: [ERROR] cmd ['ocamlbuild' '-use-ocamlfind' '-classic-display' '-j' '4' '-tag' 'debug'
-      '-build-dir' '_build' 'pkg.otarget']: exited with 10
[ERROR] The compilation of topkg.1.1.1+ox failed at "ocaml pkg/pkg.ml build --pkg-name topkg --dev-pkg false".
build failed... 

=== STDERR ===

2026-09-28 15:20.19: FAILED: tool topkg.1.1.1+ox
2026-09-28 15:20.19: Job failed: tool failed: topkg.1.1.1+ox