Build:
  1. 0
2026-09-28 15:43.08: New job: build conf-cuda.1 (e18d310c4d2d)
2026-09-28 15:43.08: [profile oxcaml-odoc-master] build conf-cuda.1
2026-09-28 15:43.08: build conf-cuda.1 (e18d310c4d2d)
=== DEPENDENCIES (7 transitive) ===
  conf-autoconf.1                                    43fe4a407b7a
  conf-cuda-config.1                                 032ebbc4bce7
  conf-which.1                                       5fccb3a41099
  ocaml.5.4.0                                        74a2c67841c6
  ocaml-config.3                                     d58db97ddfef
  ocaml-variants.5.4.0+ox                            4babdc19da91
  oxcaml-compiler.5.4.0-ox7                          42053eeff39a
=== STDOUT ===
Processing: [default: loading data]
[conf-cuda: sh cat <<EOF > test.c
   #include  "cuda.h"
   #include  "nvrtc.h"
   ]
+ /usr/bin/sh "-exc" "cat <<EOF > test.c\n   #include  \"cuda.h\"\n   #include  \"nvrtc.h\"\n   " (CWD=/home/opam/.opam/default/.opam-switch/build/conf-cuda.1)
- + cat
[conf-cuda: sh]
+ /usr/bin/sh "-exc" "$(ocamlc -config-var c_compiler) -c $CFLAGS -I'/usr/local/cuda/include' test.c" (CWD=/home/opam/.opam/default/.opam-switch/build/conf-cuda.1)
- + ocamlc -config-var c_compiler
- + gcc -c -I/usr/local/cuda/include test.c
- test.c:1:14: fatal error: cuda.h: No such file or directory
-     1 |    #include  "cuda.h"
-       |              ^~~~~~~~
- compilation terminated.
[ERROR] The compilation of conf-cuda.1 failed at "sh -exc $(ocamlc -config-var c_compiler) -c $CFLAGS -I'/usr/local/cuda/include' test.c".
build failed... 

=== STDERR ===

2026-09-28 15:43.15: FAILED: build conf-cuda.1
2026-09-28 15:43.15: Job failed: build failed: conf-cuda.1