Build:
  1. 0
2026-09-28 15:43.25: New job: build termbox.0.1.0 (a74d939cb25e)
2026-09-28 15:43.25: [profile oxcaml-odoc-master] build termbox.0.1.0
2026-09-28 15:43.25: build termbox.0.1.0 (a74d939cb25e)
=== DEPENDENCIES (7 transitive) ===
  conf-autoconf.1                                    43fe4a407b7a
  conf-which.1                                       5fccb3a41099
  ocaml.5.4.0                                        74a2c67841c6
  ocaml-config.3                                     d58db97ddfef
  ocaml-variants.5.4.0+ox                            4babdc19da91
  ocamlfind.1.9.8+ox                                 47b14ae6bc12
  oxcaml-compiler.5.4.0-ox7                          42053eeff39a
=== STDOUT ===
Processing: [default: loading data]
[WARNING] These additional system packages are required, but not available on your system: python
[termbox.0.1.0: dl]
[termbox.0.1.0: extract]
-> retrieved termbox.0.1.0  (https://opam.ocaml.org/cache)
[termbox: make]
+ /usr/bin/make  (CWD=/home/opam/.opam/default/.opam-switch/build/termbox.0.1.0)
- cd termbox && ./waf configure && ./waf
- env: 'python': No such file or directory
- make: *** [Makefile:26: termbox/build/src/libtermbox.a] Error 127
[ERROR] The compilation of termbox.0.1.0 failed at "make".
build failed... 

=== STDERR ===

2026-09-28 15:43.28: FAILED: build termbox.0.1.0
2026-09-28 15:43.28: Job failed: build failed: termbox.0.1.0