Build:
  1. 0
2026-09-28 15:55.45: New job: build ahrocksdb.0.2.2 (f85985c63c73)
2026-09-28 15:55.45: Waiting for resource in pool day11-builds
2026-09-28 16:00.45: Got resource from pool day11-builds
2026-09-28 16:00.45: [profile oxcaml-odoc-master] build ahrocksdb.0.2.2
2026-09-28 16:00.45: build ahrocksdb.0.2.2 (f85985c63c73)
=== DEPENDENCIES (21 transitive) ===
  astring.0.8.5                                      42dbc2ad915a
  base-threads.base                                  ddcab511c589
  base-unix.base                                     742554e1dbc2
  conf-autoconf.1                                    43fe4a407b7a
  conf-pkg-config.5                                  5bc8297bba82
  conf-rocksdb.2                                     f20bda0ef6c1
  conf-which.1                                       5fccb3a41099
  csexp.1.5.2                                        ac277789f184
  ctypes.0.24.0+ox                                   4660e9fbc32b
  dune.3.22.2+ox                                     057b1ed5957b
  dune-configurator.3.22.2+ox                        86e12d406fa5
  integers.0.8.0                                     6992343ae57d
  ocaml.5.4.0                                        74a2c67841c6
  ocaml-config.3                                     d58db97ddfef
  ocaml-variants.5.4.0+ox                            4babdc19da91
  ocamlbuild.0.16.1+ox                               55da2dcae837
  ocamlfind.1.9.8+ox                                 47b14ae6bc12
  oxcaml-compiler.5.4.0-ox7                          42053eeff39a
  rresult.0.7.0                                      189b81ca94de
  stdlib-shims.0.3.0                                 36fee4c2b40b
  topkg.1.1.1+ox                                     6335c019c657
=== STDOUT ===
Processing: [default: loading data]
[ahrocksdb.0.2.2: dl]
[ahrocksdb.0.2.2: extract]
-> retrieved ahrocksdb.0.2.2  (https://opam.ocaml.org/cache)
[ahrocksdb: dune build]
+ /home/opam/.opam/default/bin/dune "build" "-p" "ahrocksdb" "-j" "39" (CWD=/home/opam/.opam/default/.opam-switch/build/ahrocksdb.0.2.2)
- (cd _build/default && /home/opam/.opam/default/bin/ocamlc.opt -w -40 -w no-unused-parameter -g -bin-annot -bin-annot-occurrences -bin-annot-cms -I ffi/bindings/.rocksdb_bindings.objs/byte -I /home/opam/.opam/default/lib/ctypes -I /home/opam/.opam/default/lib/ctypes/stubs -I /home/opam/.opam/default/lib/integers -I /home/opam/.opam/default/lib/ocaml/str -I /home/opam/.opam/default/lib/stdlib-shims -I ffi/structs/.rocksdb_types.objs/byte -no-alias-deps -open Rocksdb_bindings__ -o ffi/bindings/.rocksdb_bindings.objs/byte/rocksdb_bindings__Views.cmo -c -impl ffi/bindings/views.ml)
- File "_none_", line 1:
- Alert ocaml_deprecated_cli: Setting a warning with a sequence of lowercase or uppercase letters,
- like 'arameter', is deprecated.
- Use the equivalent signed form: -n-o-u-n-u-s-e-d-p-a-r-a-m-e-t-e-r.
- Hint: Enabling or disabling a warning by its mnemonic name requires a + or - prefix.
- Hint: Did you make a spelling mistake when using a mnemonic name?
- (cd _build/default && /home/opam/.opam/default/bin/ocamlopt.opt -w -40 -w no-unused-parameter -g -I ffi/bindings/.rocksdb_bindings.objs/byte -I ffi/bindings/.rocksdb_bindings.objs/native -I /home/opam/.opam/default/lib/ctypes -I /home/opam/.opam/default/lib/ctypes/stubs -I /home/opam/.opam/default/lib/integers -I /home/opam/.opam/default/lib/ocaml/str -I /home/opam/.opam/default/lib/stdlib-shims -I ffi/structs/.rocksdb_types.objs/byte -I ffi/structs/.rocksdb_types.objs/native -cmi-file ffi/bindings/.rocksdb_bindings.objs/byte/rocksdb_bindings__Views.cmi -no-alias-deps -open Rocksdb_bindings__ -o ffi/bindings/.rocksdb_bindings.objs/native/rocksdb_bindings__Views.cmx -c -impl ffi/bindings/views.ml)
- File "_none_", line 1:
- Alert ocaml_deprecated_cli: Setting a warning with a sequence of lowercase or uppercase letters,
- like 'arameter', is deprecated.
- Use the equivalent signed form: -n-o-u-n-u-s-e-d-p-a-r-a-m-e-t-e-r.
- Hint: Enabling or disabling a warning by its mnemonic name requires a + or - prefix.
- Hint: Did you make a spelling mistake when using a mnemonic name?
- File "ffi/lib/dune", lines 23-26, characters 0-155:
- 23 | (rule
- 24 |  (targets c_flags.sexp c_library_flags.sexp c_flags.txt c_library_flags.txt)
- 25 |  (deps    (:discover config/discover.exe))
- 26 |  (action  (run %{discover})))
- (cd _build/default/ffi/lib && config/discover.exe)
- failed to find an include path for RocksDB: are development headers installed on your system ?
- tested paths: /usr/local/include/rocksdb /usr/include/rocksdb
- compiling c program:
-  | 
-  | 
-  | #include <c.h>
-  | #include <version.h>
-  | 
-  | int main() {
-  |   rocksdb_options_t* opt = rocksdb_options_create();
-  |   rocksdb_options_destroy(opt);
-  |   return 0;
-  | };
-  | 
- run: gcc -O2 -fno-strict-aliasing -fwrapv -fPIC  -pthread  -I/usr/local/include/rocksdb -I /home/opam/.opam/default/lib/ocaml -o /tmp/build_94e4a0_dune/ocaml-configurator50e64a/c-test-0/test.exe /tmp/build_94e4a0_dune/ocaml-configurator50e64a/c-test-0/test.c -lm -lpthread -lrocksdb
- -> process exited with code 1
- -> stdout:
- -> stderr:
-  | /tmp/build_94e4a0_dune/ocaml-configurator50e64a/c-test-0/test.c:3:10: fatal error: c.h: No such file or directory
-  |     3 | #include <c.h>
-  |       |          ^~~~~
-  | compilation terminated.
- compiling c program:
-  | 
-  | 
-  | #include <c.h>
-  | #include <version.h>
-  | 
-  | int main() {
-  |   rocksdb_options_t* opt = rocksdb_options_create();
-  |   rocksdb_options_destroy(opt);
-  |   return 0;
-  | };
-  | 
- run: gcc -O2 -fno-strict-aliasing -fwrapv -fPIC  -pthread  -I/usr/include/rocksdb -I /home/opam/.opam/default/lib/ocaml -o /tmp/build_94e4a0_dune/ocaml-configurator50e64a/c-test-2/test.exe /tmp/build_94e4a0_dune/ocaml-configurator50e64a/c-test-2/test.c -lm -lpthread -lrocksdb
- -> process exited with code 1
- -> stdout:
- -> stderr:
-  | In file included from /tmp/build_94e4a0_dune/ocaml-configurator50e64a/c-test-2/test.c:4:
-  | /usr/include/rocksdb/version.h:7:10: fatal error: string: No such file or directory
-  |     7 | #include <string>
-  |       |          ^~~~~~~~
-  | compilation terminated.
- Error: discover error
[ERROR] The compilation of ahrocksdb.0.2.2 failed at "dune build -p ahrocksdb -j 39".
build failed... 

=== STDERR ===

2026-09-28 16:01.19: FAILED: build ahrocksdb.0.2.2
2026-09-28 16:01.19: Job failed: build failed: ahrocksdb.0.2.2