Build:
  1. 0
2026-10-01 23:18.20: New job: build ocamlscript.3.0.0 (3afe67a1bb24)
2026-10-01 23:18.20: [profile oxcaml-odoc-master] build ocamlscript.3.0.0
2026-10-01 23:18.21: build ocamlscript.3.0.0 (3afe67a1bb24)
=== DEPENDENCIES (7 transitive) ===
  conf-autoconf.1                                    43fe4a407b7a
  conf-which.1                                       5fccb3a41099
  ocaml.5.2.0                                        cda6777ccfe3
  ocaml-config.3                                     d77b853eaa33
  ocaml-variants.5.2.0+ox                            a9808a9375cd
  ocamlfind.1.9.8+ox                                 f23a347b8f5f
  oxcaml-compiler.5.2.0minus39                       9c94ae342626
=== STDOUT ===
Processing: [default: loading data]
[ocamlscript.3.0.0: dl]
[ocamlscript.3.0.0: extract]
[ocamlscript.3.0.0/ocamlscript.install: dl]
-> retrieved ocamlscript.3.0.0  (https://opam.ocaml.org/cache)
[ocamlscript: make]
+ /usr/bin/make  (CWD=/home/opam/.opam/default/.opam-switch/build/ocamlscript.3.0.0)
- ocamlfind: Package `camlp4' not found
- echo 'let version = "3.0.0"' > version.ml
- echo 'version = "3.0.0"' > META
- cat META.in >> META
- # ocamlc -pp 'camlp4orf -loc _loc' -c \
- # 	-I camlp4 pa_opt310.ml && \
- # 	cp pa_opt310.cmo pa_opt.cmo && \
- # 	cp pa_opt310.cmi pa_opt.cmi
- # ocamlc -pp 'camlp4orf -loc _loc' -c \
- # 	-I camlp4 pa_tryfinally310.ml && \
- # 	cp pa_tryfinally310.cmo pa_tryfinally.cmo && \
- # 	cp pa_tryfinally310.cmi pa_tryfinally.cmi
- make[1]: Entering directory '/home/opam/.opam/default/.opam-switch/build/ocamlscript.3.0.0'
- ocamlfind ocamldep version.ml > ._d/version.d
- ocamlfind ocamldep pipeline.ml > ._d/pipeline.d
- ocamlfind ocamldep common.ml > ._d/common.d
- ocamlfind ocamldep utils.ml > ._d/utils.d
- ocamlfind ocamldep ocaml.ml > ._d/ocaml.d
- ocamlfind ocamldep std.ml > ._d/std.d
- ocamlfind ocamldep pipeline.mli > ._bcdi/pipeline.di
- OCamlMakefile:1038: warning: pattern recipe did not update peer target '._ncdi/pipeline.di'.
- ocamlfind ocamldep common.mli > ._bcdi/common.di
- OCamlMakefile:1038: warning: pattern recipe did not update peer target '._ncdi/common.di'.
- ocamlfind ocamldep utils.mli > ._bcdi/utils.di
- OCamlMakefile:1038: warning: pattern recipe did not update peer target '._ncdi/utils.di'.
- ocamlfind ocamldep ocaml.mli > ._bcdi/ocaml.di
- OCamlMakefile:1038: warning: pattern recipe did not update peer target '._ncdi/ocaml.di'.
- ocamlfind ocamlc -package unix,str -c -dtypes -for-pack Ocamlscript version.ml
- ocamlfind ocamlc -package unix,str -c -dtypes pipeline.mli
- ocamlfind ocamlc -package unix,str -c -dtypes -for-pack Ocamlscript pipeline.ml
- ocamlfind ocamlc -package unix,str -c -dtypes common.mli
- ocamlfind ocamlc -package unix,str -c -dtypes -for-pack Ocamlscript common.ml
- ocamlfind ocamlc -package unix,str -c -dtypes utils.mli
- ocamlfind ocamlc -package unix,str -c -dtypes -for-pack Ocamlscript utils.ml
- ocamlfind ocamlc -package unix,str -c -dtypes ocaml.mli
- ocamlfind ocamlc -package unix,str -c -dtypes -for-pack Ocamlscript ocaml.ml
- ocamlfind ocamlc -package unix,str -c -dtypes -for-pack Ocamlscript std.ml
- ocamlfind ocamlc -pack              \
- 			  -o ocamlscript.cmo version.cmo pipeline.cmo common.cmo utils.cmo ocaml.cmo std.cmo
- make[1]: Leaving directory '/home/opam/.opam/default/.opam-switch/build/ocamlscript.3.0.0'
- touch bc.done
- make[1]: Entering directory '/home/opam/.opam/default/.opam-switch/build/ocamlscript.3.0.0'
- ocamlfind ocamldep -native pipeline.mli > ._ncdi/pipeline.di
- ocamlfind ocamldep -native common.mli > ._ncdi/common.di
- ocamlfind ocamldep -native utils.mli > ._ncdi/utils.di
- ocamlfind ocamldep -native ocaml.mli > ._ncdi/ocaml.di
- ocamlfind ocamlopt -package unix,str -c -dtypes -for-pack Ocamlscript version.ml
- ocamlfind ocamlopt -package unix,str -c -dtypes -for-pack Ocamlscript pipeline.ml
- ocamlfind ocamlopt -package unix,str -c -dtypes -for-pack Ocamlscript common.ml
- ocamlfind ocamlopt -package unix,str -c -dtypes -for-pack Ocamlscript utils.ml
- File "utils.ml", line 1:
- Error: "common.cmx" contains the description for unit
-        "Common" when "Ocamlscript.Common" was expected
- make[1]: *** [OCamlMakefile:951: utils.cmx] Error 2
- make[1]: Leaving directory '/home/opam/.opam/default/.opam-switch/build/ocamlscript.3.0.0'
- make: *** [OCamlMakefile:822: pack-native-code] Error 2
[ERROR] The compilation of ocamlscript.3.0.0 failed at "make".
build failed... 

=== STDERR ===

2026-10-01 23:18.34: FAILED: build ocamlscript.3.0.0
2026-10-01 23:18.34: Job failed: build failed: ocamlscript.3.0.0