Build:
  1. 0
2026-10-01 23:18.20: New job: build tophide.1.0.4 (6fa51f9d9aa4)
2026-10-01 23:18.20: [profile oxcaml-odoc-master] build tophide.1.0.4
2026-10-01 23:18.21: build tophide.1.0.4 (6fa51f9d9aa4)
=== DEPENDENCIES (7 transitive) ===
  conf-autoconf.1                                    43fe4a407b7a
  conf-which.1                                       5fccb3a41099
  ocaml.5.2.0                                        cda6777ccfe3
  ocaml-config.3                                     d77b853eaa33
  ocaml-variants.5.2.0+ox                            a9808a9375cd
  ocamlfind.1.9.8+ox                                 f23a347b8f5f
  oxcaml-compiler.5.2.0minus39                       9c94ae342626
=== STDOUT ===
Processing: [default: loading data]
[tophide.1.0.4: dl]
[tophide.1.0.4: extract]
-> retrieved tophide.1.0.4  (https://opam.ocaml.org/cache)
[tophide: make]
+ /usr/bin/make  (CWD=/home/opam/.opam/default/.opam-switch/build/tophide.1.0.4)
- cat META.in > META
- echo 'version = "1.0.4"' >> META
- ocamlc -I +compiler-libs -c tophide.ml
- File "tophide.ml", line 29, characters 25-46:
- 29 |   print_out_class_type = !print_out_class_type;
-                               ^^^^^^^^^^^^^^^^^^^^^
- Error: This expression has type
-          "Outcometree.out_class_type Format_doc.printer" =
-            "Format_doc.formatter -> Outcometree.out_class_type -> unit"
-        but an expression was expected of type
-          "Format.formatter -> Outcometree.out_class_type -> unit"
-        Type "Format_doc.formatter" is not compatible with type "Format.formatter"
- make: *** [Makefile:11: tophide.cmo] Error 2
[ERROR] The compilation of tophide.1.0.4 failed at "make".
build failed... 

=== STDERR ===

2026-10-01 23:18.33: FAILED: build tophide.1.0.4
2026-10-01 23:18.33: Job failed: build failed: tophide.1.0.4