Build:
  1. 0
2026-10-01 23:18.20: New job: build inspect.0.2.1 (27dc4519c922)
2026-10-01 23:18.20: [profile oxcaml-odoc-master] build inspect.0.2.1
2026-10-01 23:18.21: build inspect.0.2.1 (27dc4519c922)
=== DEPENDENCIES (7 transitive) ===
  conf-autoconf.1                                    43fe4a407b7a
  conf-which.1                                       5fccb3a41099
  ocaml.5.2.0                                        cda6777ccfe3
  ocaml-config.3                                     d77b853eaa33
  ocaml-variants.5.2.0+ox                            a9808a9375cd
  ocamlfind.1.9.8+ox                                 f23a347b8f5f
  oxcaml-compiler.5.2.0minus39                       9c94ae342626
=== STDOUT ===
Processing: [default: loading data]
[inspect.0.2.1: dl]
[inspect.0.2.1: extract]
-> retrieved inspect.0.2.1  (https://opam.ocaml.org/cache)
[inspect: make]
+ /usr/bin/make  (CWD=/home/opam/.opam/default/.opam-switch/build/inspect.0.2.1)
- make[1]: Entering directory '/home/opam/.opam/default/.opam-switch/build/inspect.0.2.1'
- ocamldep aux.ml > ._d/aux.d
- ocamldep value.ml > ._d/value.d
- ocamldep dot.ml > ._d/dot.d
- ocamldep sexpr.ml > ._d/sexpr.d
- ocamldep -native aux.mli > ._ncdi/aux.di
- OCamlMakefile:1140: warning: pattern recipe did not update peer target '._bcdi/aux.di'.
- ocamldep -native value.mli > ._ncdi/value.di
- OCamlMakefile:1140: warning: pattern recipe did not update peer target '._bcdi/value.di'.
- ocamldep -native dot.mli > ._ncdi/dot.di
- OCamlMakefile:1140: warning: pattern recipe did not update peer target '._bcdi/dot.di'.
- ocamldep -native sexpr.mli > ._ncdi/sexpr.di
- OCamlMakefile:1140: warning: pattern recipe did not update peer target '._bcdi/sexpr.di'.
- ocamlc -c -cc "cc" -ccopt "-fPIC  \
- 			-DPIC -DNATIVE_CODE   \
- 			    -o value_cimpl.o " value_cimpl.c
- ar rcs libinspect_stubs.a  value_cimpl.o
- ocamlc -c -w Aelz aux.mli
- File "_none_", line 1:
- Alert ocaml_deprecated_cli: Setting a warning with a sequence of lowercase or uppercase letters,
- like 'Aelz', is deprecated.
- Use the equivalent signed form: +A-e-l-z.
- Hint: Enabling or disabling a warning by its mnemonic name requires a + or - prefix.
- ocamlopt -c -w Aelz -for-pack Inspect aux.ml
- File "_none_", line 1:
- Alert ocaml_deprecated_cli: Setting a warning with a sequence of lowercase or uppercase letters,
- like 'Aelz', is deprecated.
- Use the equivalent signed form: +A-e-l-z.
- Hint: Enabling or disabling a warning by its mnemonic name requires a + or - prefix.
- ocamlc -c -w Aelz value.mli
- File "_none_", line 1:
- Alert ocaml_deprecated_cli: Setting a warning with a sequence of lowercase or uppercase letters,
- like 'Aelz', is deprecated.
- Use the equivalent signed form: +A-e-l-z.
- Hint: Enabling or disabling a warning by its mnemonic name requires a + or - prefix.
- ocamlopt -c -w Aelz -for-pack Inspect value.ml
- File "_none_", line 1:
- Alert ocaml_deprecated_cli: Setting a warning with a sequence of lowercase or uppercase letters,
- like 'Aelz', is deprecated.
- Use the equivalent signed form: +A-e-l-z.
- Hint: Enabling or disabling a warning by its mnemonic name requires a + or - prefix.
- ocamlc -c -w Aelz dot.mli
- File "_none_", line 1:
- Alert ocaml_deprecated_cli: Setting a warning with a sequence of lowercase or uppercase letters,
- like 'Aelz', is deprecated.
- Use the equivalent signed form: +A-e-l-z.
- Hint: Enabling or disabling a warning by its mnemonic name requires a + or - prefix.
- ocamlopt -c -w Aelz -for-pack Inspect dot.ml
- File "_none_", line 1:
- Alert ocaml_deprecated_cli: Setting a warning with a sequence of lowercase or uppercase letters,
- like 'Aelz', is deprecated.
- Use the equivalent signed form: +A-e-l-z.
- Hint: Enabling or disabling a warning by its mnemonic name requires a + or - prefix.
- 
- File "dot.ml", line 1:
- Error: "aux.cmx" contains the description for unit
-        "Aux" when "Inspect.Aux" was expected
- make[1]: *** [OCamlMakefile:1054: dot.cmx] Error 2
- make[1]: Leaving directory '/home/opam/.opam/default/.opam-switch/build/inspect.0.2.1'
- make: *** [OCamlMakefile:789: native-code-library] Error 2
build failed... 
[ERROR] The compilation of inspect.0.2.1 failed at "make".

=== STDERR ===

2026-10-01 23:18.43: FAILED: build inspect.0.2.1
2026-10-01 23:18.43: Job failed: build failed: inspect.0.2.1