Build:
  1. 0
2026-10-01 23:18.20: New job: build termbox.0.1.0 (f68746a98668)
2026-10-01 23:18.20: [profile oxcaml-odoc-master] build termbox.0.1.0
2026-10-01 23:18.21: build termbox.0.1.0 (f68746a98668)
=== DEPENDENCIES (7 transitive) ===
  conf-autoconf.1                                    43fe4a407b7a
  conf-which.1                                       5fccb3a41099
  ocaml.5.2.0                                        cda6777ccfe3
  ocaml-config.3                                     d77b853eaa33
  ocaml-variants.5.2.0+ox                            a9808a9375cd
  ocamlfind.1.9.8+ox                                 f23a347b8f5f
  oxcaml-compiler.5.2.0minus39                       9c94ae342626
=== STDOUT ===
Processing: [default: loading data]
[WARNING] These additional system packages are required, but not available on your system: python
[termbox.0.1.0: dl]
[termbox.0.1.0: extract]
-> retrieved termbox.0.1.0  (https://opam.ocaml.org/cache)
[termbox: make]
+ /usr/bin/make  (CWD=/home/opam/.opam/default/.opam-switch/build/termbox.0.1.0)
- cd termbox && ./waf configure && ./waf
- env: 'python': No such file or directory
- make: *** [Makefile:26: termbox/build/src/libtermbox.a] Error 127
[ERROR] The compilation of termbox.0.1.0 failed at "make".
build failed... 

=== STDERR ===

2026-10-01 23:18.33: FAILED: build termbox.0.1.0
2026-10-01 23:18.33: Job failed: build failed: termbox.0.1.0