Build:
  1. 0
2026-10-01 23:18.20: New job: build camlpdf.2.9 (ffbbfd3cd787)
2026-10-01 23:18.20: [profile oxcaml-odoc-master] build camlpdf.2.9
2026-10-01 23:18.21: build camlpdf.2.9 (ffbbfd3cd787)
=== DEPENDENCIES (7 transitive) ===
  conf-autoconf.1                                    43fe4a407b7a
  conf-which.1                                       5fccb3a41099
  ocaml.5.2.0                                        cda6777ccfe3
  ocaml-config.3                                     d77b853eaa33
  ocaml-variants.5.2.0+ox                            a9808a9375cd
  ocamlfind.1.9.8+ox                                 f23a347b8f5f
  oxcaml-compiler.5.2.0minus39                       9c94ae342626
=== STDOUT ===
Processing: [default: loading data]
[camlpdf.2.9: dl]
[camlpdf.2.9: extract]
-> retrieved camlpdf.2.9  (https://opam.ocaml.org/cache)
[camlpdf: make]
+ /usr/bin/make  (CWD=/home/opam/.opam/default/.opam-switch/build/camlpdf.2.9)
- make[1]: Entering directory '/home/opam/.opam/default/.opam-switch/build/camlpdf.2.9'
- ocamldep pdfe.ml > ._d/pdfe.d
- ocamldep pdfutil.ml > ._d/pdfutil.d
- ocamldep pdfio.ml > ._d/pdfio.d
- ocamldep pdftransform.ml > ._d/pdftransform.d
- ocamldep pdfunits.ml > ._d/pdfunits.d
- ocamldep pdfpaper.ml > ._d/pdfpaper.d
- ocamldep pdfcryptprimitives.ml > ._d/pdfcryptprimitives.d
- ocamldep pdf.ml > ._d/pdf.d
- ocamldep pdfcrypt.ml > ._d/pdfcrypt.d
- ocamldep pdfflate.ml > ._d/pdfflate.d
- ocamldep pdfcodec.ml > ._d/pdfcodec.d
- ocamldep pdfwrite.ml > ._d/pdfwrite.d
- ocamldep pdfgenlex.ml > ._d/pdfgenlex.d
- ocamldep pdfread.ml > ._d/pdfread.d
- ocamldep pdfjpeg.ml > ._d/pdfjpeg.d
- ocamldep pdfops.ml > ._d/pdfops.d
- ocamldep pdfdest.ml > ._d/pdfdest.d
- ocamldep pdfmarks.ml > ._d/pdfmarks.d
- ocamldep pdfpagelabels.ml > ._d/pdfpagelabels.d
- ocamldep pdftree.ml > ._d/pdftree.d
- ocamldep pdfst.ml > ._d/pdfst.d
- ocamldep pdfpage.ml > ._d/pdfpage.d
- ocamldep pdfannot.ml > ._d/pdfannot.d
- ocamldep pdffun.ml > ._d/pdffun.d
- ocamldep pdfspace.ml > ._d/pdfspace.d
- ocamldep pdfimage.ml > ._d/pdfimage.d
- ocamldep pdfafm.ml > ._d/pdfafm.d
- ocamldep pdfafmdata.ml > ._d/pdfafmdata.d
- ocamldep pdfglyphlist.ml > ._d/pdfglyphlist.d
- ocamldep pdfcmap.ml > ._d/pdfcmap.d
- ocamldep pdftext.ml > ._d/pdftext.d
- ocamldep pdfstandard14.ml > ._d/pdfstandard14.d
- ocamldep pdfdate.ml > ._d/pdfdate.d
- ocamldep pdfocg.ml > ._d/pdfocg.d
- ocamldep pdfmerge.ml > ._d/pdfmerge.d
- ocamldep pdfe.mli > ._bcdi/pdfe.di
- OCamlMakefile:1163: warning: pattern recipe did not update peer target '._ncdi/pdfe.di'.
- ocamldep pdfutil.mli > ._bcdi/pdfutil.di
- OCamlMakefile:1163: warning: pattern recipe did not update peer target '._ncdi/pdfutil.di'.
- ocamldep pdfio.mli > ._bcdi/pdfio.di
- OCamlMakefile:1163: warning: pattern recipe did not update peer target '._ncdi/pdfio.di'.
- ocamldep pdftransform.mli > ._bcdi/pdftransform.di
- OCamlMakefile:1163: warning: pattern recipe did not update peer target '._ncdi/pdftransform.di'.
- ocamldep pdfunits.mli > ._bcdi/pdfunits.di
- OCamlMakefile:1163: warning: pattern recipe did not update peer target '._ncdi/pdfunits.di'.
- ocamldep pdfpaper.mli > ._bcdi/pdfpaper.di
- OCamlMakefile:1163: warning: pattern recipe did not update peer target '._ncdi/pdfpaper.di'.
- ocamldep pdfcryptprimitives.mli > ._bcdi/pdfcryptprimitives.di
- OCamlMakefile:1163: warning: pattern recipe did not update peer target '._ncdi/pdfcryptprimitives.di'.
- ocamldep pdf.mli > ._bcdi/pdf.di
- OCamlMakefile:1163: warning: pattern recipe did not update peer target '._ncdi/pdf.di'.
- ocamldep pdfcrypt.mli > ._bcdi/pdfcrypt.di
- OCamlMakefile:1163: warning: pattern recipe did not update peer target '._ncdi/pdfcrypt.di'.
- ocamldep pdfflate.mli > ._bcdi/pdfflate.di
- OCamlMakefile:1163: warning: pattern recipe did not update peer target '._ncdi/pdfflate.di'.
- ocamldep pdfcodec.mli > ._bcdi/pdfcodec.di
- OCamlMakefile:1163: warning: pattern recipe did not update peer target '._ncdi/pdfcodec.di'.
- ocamldep pdfwrite.mli > ._bcdi/pdfwrite.di
- OCamlMakefile:1163: warning: pattern recipe did not update peer target '._ncdi/pdfwrite.di'.
- ocamldep pdfgenlex.mli > ._bcdi/pdfgenlex.di
- OCamlMakefile:1163: warning: pattern recipe did not update peer target '._ncdi/pdfgenlex.di'.
- ocamldep pdfread.mli > ._bcdi/pdfread.di
- OCamlMakefile:1163: warning: pattern recipe did not update peer target '._ncdi/pdfread.di'.
- ocamldep pdfjpeg.mli > ._bcdi/pdfjpeg.di
- OCamlMakefile:1163: warning: pattern recipe did not update peer target '._ncdi/pdfjpeg.di'.
- ocamldep pdfops.mli > ._bcdi/pdfops.di
- OCamlMakefile:1163: warning: pattern recipe did not update peer target '._ncdi/pdfops.di'.
- ocamldep pdfdest.mli > ._bcdi/pdfdest.di
- OCamlMakefile:1163: warning: pattern recipe did not update peer target '._ncdi/pdfdest.di'.
- ocamldep pdfmarks.mli > ._bcdi/pdfmarks.di
- OCamlMakefile:1163: warning: pattern recipe did not update peer target '._ncdi/pdfmarks.di'.
- ocamldep pdfpagelabels.mli > ._bcdi/pdfpagelabels.di
- OCamlMakefile:1163: warning: pattern recipe did not update peer target '._ncdi/pdfpagelabels.di'.
- ocamldep pdftree.mli > ._bcdi/pdftree.di
- OCamlMakefile:1163: warning: pattern recipe did not update peer target '._ncdi/pdftree.di'.
- ocamldep pdfst.mli > ._bcdi/pdfst.di
- OCamlMakefile:1163: warning: pattern recipe did not update peer target '._ncdi/pdfst.di'.
- ocamldep pdfpage.mli > ._bcdi/pdfpage.di
- OCamlMakefile:1163: warning: pattern recipe did not update peer target '._ncdi/pdfpage.di'.
- ocamldep pdfannot.mli > ._bcdi/pdfannot.di
- OCamlMakefile:1163: warning: pattern recipe did not update peer target '._ncdi/pdfannot.di'.
- ocamldep pdffun.mli > ._bcdi/pdffun.di
- OCamlMakefile:1163: warning: pattern recipe did not update peer target '._ncdi/pdffun.di'.
- ocamldep pdfspace.mli > ._bcdi/pdfspace.di
- OCamlMakefile:1163: warning: pattern recipe did not update peer target '._ncdi/pdfspace.di'.
- ocamldep pdfimage.mli > ._bcdi/pdfimage.di
- OCamlMakefile:1163: warning: pattern recipe did not update peer target '._ncdi/pdfimage.di'.
- ocamldep pdfafm.mli > ._bcdi/pdfafm.di
- OCamlMakefile:1163: warning: pattern recipe did not update peer target '._ncdi/pdfafm.di'.
- ocamldep pdfafmdata.mli > ._bcdi/pdfafmdata.di
- OCamlMakefile:1163: warning: pattern recipe did not update peer target '._ncdi/pdfafmdata.di'.
- ocamldep pdfglyphlist.mli > ._bcdi/pdfglyphlist.di
- OCamlMakefile:1163: warning: pattern recipe did not update peer target '._ncdi/pdfglyphlist.di'.
- ocamldep pdfcmap.mli > ._bcdi/pdfcmap.di
- OCamlMakefile:1163: warning: pattern recipe did not update peer target '._ncdi/pdfcmap.di'.
- ocamldep pdftext.mli > ._bcdi/pdftext.di
- OCamlMakefile:1163: warning: pattern recipe did not update peer target '._ncdi/pdftext.di'.
- ocamldep pdfstandard14.mli > ._bcdi/pdfstandard14.di
- OCamlMakefile:1163: warning: pattern recipe did not update peer target '._ncdi/pdfstandard14.di'.
- ocamldep pdfdate.mli > ._bcdi/pdfdate.di
- OCamlMakefile:1163: warning: pattern recipe did not update peer target '._ncdi/pdfdate.di'.
- ocamldep pdfocg.mli > ._bcdi/pdfocg.di
- OCamlMakefile:1163: warning: pattern recipe did not update peer target '._ncdi/pdfocg.di'.
- ocamldep pdfmerge.mli > ._bcdi/pdfmerge.di
- OCamlMakefile:1163: warning: pattern recipe did not update peer target '._ncdi/pdfmerge.di'.
- ocamlc   \
- 			-c -cc "cc"     -ccopt "-fPIC -g \
- 			-DPIC   \
- 			    -o flatestubs.o " flatestubs.c
- ocamlc   \
- 			-c -cc "cc"     -ccopt "-fPIC -g \
- 			-DPIC   \
- 			    -o rijndael-alg-fst.o " rijndael-alg-fst.c
- ocamlc   \
- 			-c -cc "cc"     -ccopt "-fPIC -g \
- 			-DPIC   \
- 			    -o stubs-aes.o " stubs-aes.c
- ocamlc   \
- 			-c -cc "cc"     -ccopt "-fPIC -g \
- 			-DPIC   \
- 			    -o sha2.o " sha2.c
- ocamlc   \
- 			-c -cc "cc"     -ccopt "-fPIC -g \
- 			-DPIC   \
- 			    -o stubs-sha2.o " stubs-sha2.c
- ar rcs libcamlpdf_stubs.a  flatestubs.o rijndael-alg-fst.o stubs-aes.o sha2.o stubs-sha2.o
- ocamlc -c -bin-annot pdfe.mli
- ocamlc -c -bin-annot -g -safe-string pdfe.ml
- OCamlMakefile:1076: warning: pattern recipe did not update peer target 'pdfe.o'.
- ocamlc -c -bin-annot pdfutil.mli
- ocamlc -c -bin-annot -g -safe-string pdfutil.ml
- File "pdfutil.ml", line 1:
- Error: The implementation "pdfutil.ml"
-        does not match the interface "pdfutil.cmi": 
-        Values do not match:
-          val mem : 'a @ local -> 'a list @ local -> bool
-        is not included in
-          val mem : 'a -> 'a list -> bool
-        The type "'a @ local -> 'a list @ local -> bool"
-        is not compatible with the type "'a -> 'a list -> bool"
-        File "pdfutil.mli", line 107, characters 0-33: Expected declaration
-        File "pdfutil.ml", line 534, characters 4-7: Actual declaration
- make[1]: *** [OCamlMakefile:1076: pdfutil.cmo] Error 2
- make[1]: Leaving directory '/home/opam/.opam/default/.opam-switch/build/camlpdf.2.9'
- make: *** [OCamlMakefile:792: byte-code-library] Error 2
[ERROR] The compilation of camlpdf.2.9 failed at "make".
build failed... 

=== STDERR ===

2026-10-01 23:18.49: FAILED: build camlpdf.2.9
2026-10-01 23:18.49: Job failed: build failed: camlpdf.2.9