Build:
- 0
2026-10-01 23:31.31: New job: build multicont.1.0.3 (98248fdc4671)
2026-10-01 23:31.31: Waiting for resource in pool day11-builds
2026-10-01 23:37.06: Got resource from pool day11-builds
2026-10-01 23:37.06: [profile oxcaml-odoc-master] build multicont.1.0.3
2026-10-01 23:37.06: build multicont.1.0.3 (98248fdc4671)
=== DEPENDENCIES (11 transitive) ===
base-threads.base ddcab511c589
base-unix.base 742554e1dbc2
conf-autoconf.1 43fe4a407b7a
conf-which.1 5fccb3a41099
csexp.1.5.2 a9d3fd6f82d9
dune.3.22.2+ox a2ef013eeea9
dune-configurator.3.22.2+ox dea98c56dd29
ocaml.5.2.0 cda6777ccfe3
ocaml-config.3 d77b853eaa33
ocaml-variants.5.2.0+ox a9808a9375cd
oxcaml-compiler.5.2.0minus39 9c94ae342626
=== STDOUT ===
Processing: [default: loading data]
[multicont.1.0.3: dl]
[multicont.1.0.3: extract]
-> retrieved multicont.1.0.3 (https://opam.ocaml.org/cache)
[multicont: dune build]
+ /home/opam/.opam/default/bin/dune "build" "-p" "multicont" "-j" "39" "@install" (CWD=/home/opam/.opam/default/.opam-switch/build/multicont.1.0.3)
[ERROR] The compilation of multicont.1.0.3 failed at "dune build -p multicont -j 39 @install".
- File "lib/dune", line 9, characters 9-24:
- 9 | (names multicont_stubs))
- ^^^^^^^^^^^^^^^
- (cd _build/default/lib && /usr/bin/gcc -O2 -fno-strict-aliasing -fwrapv -pthread -fPIC -pthread -D_FILE_OFFSET_BITS=64 -Wall -fdiagnostics-color=always -g -I /home/opam/.opam/default/lib/ocaml -o multicont_stubs_byte.o -c multicont_stubs.c)
- multicont_stubs.c: In function 'multicont_clone_continuation':
- multicont_stubs.c:107:15: error: too few arguments to function 'caml_alloc_stack_noexc'
- 107 | clone = caml_alloc_stack_noexc(Stack_high(current) - Stack_base(current),
- | ^~~~~~~~~~~~~~~~~~~~~~
- In file included from multicont_stubs.c:6:
- /home/opam/.opam/default/lib/ocaml/caml/fiber.h:312:20: note: declared here
- 312 | struct stack_info* caml_alloc_stack_noexc(mlsize_t wosize, value hval,
- | ^~~~~~~~~~~~~~~~~~~~~~
- File "lib/dune", line 14, characters 9-24:
- 14 | (names multicont_stubs)))
- ^^^^^^^^^^^^^^^
- (cd _build/default/lib && /usr/bin/gcc -O2 -fno-strict-aliasing -fwrapv -pthread -fPIC -pthread -D_FILE_OFFSET_BITS=64 -Wall -fdiagnostics-color=always -DNATIVE_CODE -g -I /home/opam/.opam/default/lib/ocaml -o multicont_stubs_native.o -c multicont_stubs.c)
- multicont_stubs.c: In function 'multicont_clone_continuation':
- multicont_stubs.c:107:15: error: too few arguments to function 'caml_alloc_stack_noexc'
- 107 | clone = caml_alloc_stack_noexc(Stack_high(current) - Stack_base(current),
- | ^~~~~~~~~~~~~~~~~~~~~~
- In file included from multicont_stubs.c:6:
- /home/opam/.opam/default/lib/ocaml/caml/fiber.h:312:20: note: declared here
- 312 | struct stack_info* caml_alloc_stack_noexc(mlsize_t wosize, value hval,
- | ^~~~~~~~~~~~~~~~~~~~~~
- multicont_stubs.c:123:77: error: passing argument 3 of 'caml_rewrite_exception_stack' from incompatible pointer type [-Wincompatible-pointer-types]
- 123 | caml_rewrite_exception_stack(current, (value**)&clone->exception_ptr, clone);
- | ^~~~~
- | |
- | struct stack_info *
- /home/opam/.opam/default/lib/ocaml/caml/fiber.h:344:55: note: expected 'value **' {aka 'long int **'} but argument is of type 'struct stack_info *'
- 344 | value** exn_ptr, value** async_exn_ptr,
- | ~~~~~~~~^~~~~~~~~~~~~
- multicont_stubs.c:123:7: error: too few arguments to function 'caml_rewrite_exception_stack'
- 123 | caml_rewrite_exception_stack(current, (value**)&clone->exception_ptr, clone);
- | ^~~~~~~~~~~~~~~~~~~~~~~~~~~~
- /home/opam/.opam/default/lib/ocaml/caml/fiber.h:343:1: note: declared here
- 343 | caml_rewrite_exception_stack(struct stack_info *old_stack,
- | ^~~~~~~~~~~~~~~~~~~~~~~~~~~~
build failed...
=== STDERR ===
2026-10-01 23:37.21: FAILED: build multicont.1.0.3
2026-10-01 23:37.21: Job failed: build failed: multicont.1.0.3