Build:
- 0
2026-10-01 23:39.59: New job: build ahrocksdb.0.2.2 (f0f3206fcbe2)
2026-10-01 23:39.59: Waiting for resource in pool day11-builds
2026-10-01 23:46.39: Got resource from pool day11-builds
2026-10-01 23:46.39: [profile oxcaml-odoc-master] build ahrocksdb.0.2.2
2026-10-01 23:46.39: build ahrocksdb.0.2.2 (f0f3206fcbe2)
=== DEPENDENCIES (21 transitive) ===
astring.0.8.5 b44ebb6673e9
base-threads.base ddcab511c589
base-unix.base 742554e1dbc2
conf-autoconf.1 43fe4a407b7a
conf-pkg-config.5 5bc8297bba82
conf-rocksdb.2 f20bda0ef6c1
conf-which.1 5fccb3a41099
csexp.1.5.2 a9d3fd6f82d9
ctypes.0.24.0+ox bfa3d12be43a
dune.3.22.2+ox a2ef013eeea9
dune-configurator.3.22.2+ox dea98c56dd29
integers.0.8.0 8a484753c4bc
ocaml.5.2.0 cda6777ccfe3
ocaml-config.3 d77b853eaa33
ocaml-variants.5.2.0+ox a9808a9375cd
ocamlbuild.0.16.1+ox 63a719bfd385
ocamlfind.1.9.8+ox f23a347b8f5f
oxcaml-compiler.5.2.0minus39 9c94ae342626
rresult.0.7.0 2f8dffc83d95
stdlib-shims.0.3.0 872ba8883981
topkg.1.1.1+ox 12497656aa9b
=== STDOUT ===
Processing: [default: loading data]
[ahrocksdb.0.2.2: dl]
[ahrocksdb.0.2.2: extract]
-> retrieved ahrocksdb.0.2.2 (https://opam.ocaml.org/cache)
[ahrocksdb: dune build]
+ /home/opam/.opam/default/bin/dune "build" "-p" "ahrocksdb" "-j" "39" (CWD=/home/opam/.opam/default/.opam-switch/build/ahrocksdb.0.2.2)
- (cd _build/default && /home/opam/.opam/default/bin/ocamlc.opt -w -40 -w no-unused-parameter -g -bin-annot -bin-annot-occurrences -bin-annot-cms -I ffi/bindings/.rocksdb_bindings.objs/byte -I /home/opam/.opam/default/lib/ctypes -I /home/opam/.opam/default/lib/ctypes/stubs -I /home/opam/.opam/default/lib/integers -I /home/opam/.opam/default/lib/ocaml/str -I /home/opam/.opam/default/lib/stdlib-shims -I ffi/structs/.rocksdb_types.objs/byte -no-alias-deps -open Rocksdb_bindings__ -o ffi/bindings/.rocksdb_bindings.objs/byte/rocksdb_bindings__Views.cmo -c -impl ffi/bindings/views.ml)
- File "_none_", line 1:
- Alert ocaml_deprecated_cli: Setting a warning with a sequence of lowercase or uppercase letters,
- like 'arameter', is deprecated.
- Use the equivalent signed form: -n-o-u-n-u-s-e-d-p-a-r-a-m-e-t-e-r.
- Hint: Enabling or disabling a warning by its mnemonic name requires a + or - prefix.
- Hint: Did you make a spelling mistake when using a mnemonic name?
- (cd _build/default && /home/opam/.opam/default/bin/ocamlopt.opt -w -40 -w no-unused-parameter -g -I ffi/bindings/.rocksdb_bindings.objs/byte -I ffi/bindings/.rocksdb_bindings.objs/native -I /home/opam/.opam/default/lib/ctypes -I /home/opam/.opam/default/lib/ctypes/stubs -I /home/opam/.opam/default/lib/integers -I /home/opam/.opam/default/lib/ocaml/str -I /home/opam/.opam/default/lib/stdlib-shims -I ffi/structs/.rocksdb_types.objs/byte -I ffi/structs/.rocksdb_types.objs/native -cmi-file ffi/bindings/.rocksdb_bindings.objs/byte/rocksdb_bindings__Views.cmi -no-alias-deps -open Rocksdb_bindings__ -o ffi/bindings/.rocksdb_bindings.objs/native/rocksdb_bindings__Views.cmx -c -impl ffi/bindings/views.ml)
- File "_none_", line 1:
- Alert ocaml_deprecated_cli: Setting a warning with a sequence of lowercase or uppercase letters,
- like 'arameter', is deprecated.
- Use the equivalent signed form: -n-o-u-n-u-s-e-d-p-a-r-a-m-e-t-e-r.
- Hint: Enabling or disabling a warning by its mnemonic name requires a + or - prefix.
- Hint: Did you make a spelling mistake when using a mnemonic name?
- File "ffi/lib/dune", lines 23-26, characters 0-155:
- 23 | (rule
- 24 | (targets c_flags.sexp c_library_flags.sexp c_flags.txt c_library_flags.txt)
- 25 | (deps (:discover config/discover.exe))
- 26 | (action (run %{discover})))
- (cd _build/default/ffi/lib && config/discover.exe)
- failed to find an include path for RocksDB: are development headers installed on your system ?
- tested paths: /usr/local/include/rocksdb /usr/include/rocksdb
- compiling c program:
- |
- |
- | #include <c.h>
- | #include <version.h>
- |
- | int main() {
- | rocksdb_options_t* opt = rocksdb_options_create();
- | rocksdb_options_destroy(opt);
- | return 0;
- | };
- |
- run: gcc -O2 -fno-strict-aliasing -fwrapv -pthread -fPIC -pthread -I/usr/local/include/rocksdb -I /home/opam/.opam/default/lib/ocaml -o /tmp/build_09c409_dune/ocaml-configurator9a6e52/c-test-0/test.exe /tmp/build_09c409_dune/ocaml-configurator9a6e52/c-test-0/test.c -lm -lpthread -lrocksdb
- -> process exited with code 1
- -> stdout:
- -> stderr:
- | /tmp/build_09c409_dune/ocaml-configurator9a6e52/c-test-0/test.c:3:10: fatal error: c.h: No such file or directory
- | 3 | #include <c.h>
- | | ^~~~~
- | compilation terminated.
- compiling c program:
- |
- |
- | #include <c.h>
- | #include <version.h>
- |
- | int main() {
- | rocksdb_options_t* opt = rocksdb_options_create();
- | rocksdb_options_destroy(opt);
- | return 0;
- | };
- |
- run: gcc -O2 -fno-strict-aliasing -fwrapv -pthread -fPIC -pthread -I/usr/include/rocksdb -I /home/opam/.opam/default/lib/ocaml -o /tmp/build_09c409_dune/ocaml-configurator9a6e52/c-test-2/test.exe /tmp/build_09c409_dune/ocaml-configurator9a6e52/c-test-2/test.c -lm -lpthread -lrocksdb
- -> process exited with code 1
- -> stdout:
- -> stderr:
- | In file included from /tmp/build_09c409_dune/ocaml-configurator9a6e52/c-test-2/test.c:4:
- | /usr/include/rocksdb/version.h:7:10: fatal error: string: No such file or directory
- | 7 | #include <string>
- | | ^~~~~~~~
- | compilation terminated.
- Error: discover error
[ERROR] The compilation of ahrocksdb.0.2.2 failed at "dune build -p ahrocksdb -j 39".
build failed...
=== STDERR ===
2026-10-01 23:48.33: FAILED: build ahrocksdb.0.2.2
2026-10-01 23:48.33: Job failed: build failed: ahrocksdb.0.2.2