Build:
- 0
2026-10-02 00:38.07: New job: build guile.1.0 (bb2e9feca3ad)
2026-10-02 00:38.07: Waiting for resource in pool day11-builds
2026-10-02 00:41.35: Got resource from pool day11-builds
2026-10-02 00:41.35: [profile oxcaml-odoc-master] build guile.1.0
2026-10-02 00:41.35: build guile.1.0 (bb2e9feca3ad)
=== DEPENDENCIES (54 transitive) ===
astring.0.8.5 b44ebb6673e9
base.v0.18~preview.130.106+341 0b00d1f69090
base-threads.base ddcab511c589
base-unix.base 742554e1dbc2
base_internalhash_types.v0.18~preview.130.106+341 7ca38d487be8
basement.v0.18~preview.130.106+341 974f1514a067
camlp-streams.5.0.1 3a541441f2a0
capsule0.v0.18~preview.130.106+341 117fe09c7440
conf-autoconf.1 43fe4a407b7a
conf-gmp.5 00570d20295f
conf-guile.1 242727f8e477
conf-libffi.2.0.0 2de1e6fba1f5
conf-pkg-config.5 5bc8297bba82
conf-which.1 5fccb3a41099
csexp.1.5.2 a9d3fd6f82d9
ctypes.0.24.0+ox bfa3d12be43a
ctypes-foreign.0.24.0+ox dd2923a41049
dune.3.22.2+ox a2ef013eeea9
dune-configurator.3.22.2+ox dea98c56dd29
integers.0.8.0 8a484753c4bc
nonempty_list_type.v0.18~preview.130.106+341 1ee66e605264
num.1.6 da35670984d3
ocaml.5.2.0 cda6777ccfe3
ocaml-compiler-libs.v0.17.0+ox c80aba262c43
ocaml-config.3 d77b853eaa33
ocaml-variants.5.2.0+ox a9808a9375cd
ocaml_intrinsics_kernel.v0.18~preview.130.106+341 59e633b60c98
ocamlbuild.0.16.1+ox 63a719bfd385
ocamlfind.1.9.8+ox f23a347b8f5f
odoc-parser.3.2.1+master.1790607351.6dc5826 5374e5d0266d
oxcaml-compiler.5.2.0minus39 9c94ae342626
parsexp.v0.18~preview.130.106+341 8d7b1681609c
ppx_array_base.v0.18~preview.130.106+341 5ee0516a8b3f
ppx_base.v0.18~preview.130.106+341 56482540038b
ppx_compare.v0.18~preview.130.106+341 b1c27a1ff1aa
ppx_derivers.1.2.1 bfa8af8a2975
ppx_enumerate.v0.18~preview.130.106+341 f13b02bba837
ppx_globalize.v0.18~preview.130.106+341 ba2bb7f46dee
ppx_hash.v0.18~preview.130.106+341 1acaa91e4b9c
ppx_helpers.v0.18~preview.130.106+341 1480dc0f2b8f
ppx_js_style.v0.18~preview.130.106+341 92138b6a04ae
ppx_sexp_conv.v0.18~preview.130.106+341 47cc995adb60
ppx_shorthand.v0.18~preview.130.106+341 2c3677f9d065
ppx_template.v0.18~preview.130.106+341 1fee223d4751
ppxlib.0.33.0+ox2 a8c22dcd95e4
ppxlib_ast.0.33.0+ox2 208c0a263aea
ppxlib_jane.v0.18~preview.130.106+341 f193b6e88a9a
sexp_type.v0.18~preview.130.106+341 365b308b7069
sexplib.v0.18~preview.130.106+341 f0d968bdeba3
sexplib0.v0.18~preview.130.106+341 681b43b3334e
stdio.v0.18~preview.130.106+341 13ea52fb291c
stdlib-shims.0.3.0 872ba8883981
topkg.1.1.1+ox 12497656aa9b
unique.v0.18~preview.130.106+341 13aef6cb7511
=== STDOUT ===
Processing: [default: loading data]
[guile.1.0: dl]
[guile.1.0: extract]
-> retrieved guile.1.0 (https://opam.ocaml.org/cache)
[guile: dune build]
+ /home/opam/.opam/default/bin/dune "build" "-p" "guile" "-j" "39" "--promote-install-files=false" "@install" (CWD=/home/opam/.opam/default/.opam-switch/build/guile.1.0)
- File "stubgen/dune", lines 12-16, characters 0-263:
- 12 | (rule (targets bindings_stubs_gen.exe)
- 13 | (deps bindings_stubs_gen.c c_flags c_library_flags)
- 14 | (action
- 15 | (bash
- 16 | "%{cc} bindings_stubs_gen.c -I `dirname %{lib:ctypes:ctypes_cstubs_internals.h}` -I %{ocaml_where} $(< c_flags) $(< c_library_flags) -o %{targets}")))
- (cd _build/default/stubgen && /usr/bin/bash -e -u -o pipefail -c 'gcc -O2 -fno-strict-aliasing -fwrapv -pthread -fPIC -pthread -D_FILE_OFFSET_BITS=64 -Wall -fdiagnostics-color=always bindings_stubs_gen.c -I `dirname /home/opam/.opam/default/lib/ctypes/ctypes_cstubs_internals.h` -I /home/opam/.opam/default/lib/ocaml $(< c_flags) $(< c_library_flags) -o bindings_stubs_gen.exe')
- In file included from /home/opam/.opam/default/lib/ctypes/ctypes_primitives.h:16,
- from /home/opam/.opam/default/lib/ctypes/ctypes_cstubs_internals.h:13,
- from bindings_stubs_gen.c:6:
- /home/opam/.opam/default/lib/ctypes/ocaml_integers.h:37:9: warning: "Int8_val" redefined
- 37 | #define Int8_val(V) ((int8_t)(Int_val(V)))
- | ^~~~~~~~
- In file included from /home/opam/.opam/default/lib/ctypes/ocaml_integers.h:11:
- /home/opam/.opam/default/lib/ocaml/caml/mlvalues.h:154:9: note: this is the location of the previous definition
- 154 | #define Int8_val(x) ((int8_t) Long_val(x))
- | ^~~~~~~~
- /home/opam/.opam/default/lib/ctypes/ocaml_integers.h:38:9: warning: "Int16_val" redefined
- 38 | #define Int16_val(V) ((int16_t)(Int_val(V)))
- | ^~~~~~~~~
- /home/opam/.opam/default/lib/ocaml/caml/mlvalues.h:153:9: note: this is the location of the previous definition
- 153 | #define Int16_val(x) ((int16_t) Long_val(x))
- | ^~~~~~~~~
- bindings_stubs_gen.c: In function 'main':
- bindings_stubs_gen.c:35:41: warning: cast from pointer to integer of different size [-Wpointer-to-int-cast]
- 35 | enum { check_SCM_UNDEFINED_const = (int)SCM_UNDEFINED };
- | ^
- bindings_stubs_gen.c:36:19: error: initialization of 'intptr_t' {aka 'long int'} from 'struct scm_unused_struct *' makes integer from pointer without a cast [-Wint-conversion]
- 36 | intptr_t v = (SCM_UNDEFINED);
- | ^
- bindings_stubs_gen.c:42:35: warning: cast from pointer to integer of different size [-Wpointer-to-int-cast]
- 42 | enum { check_SCM_EOL_const = (int)SCM_EOL };
- | ^
- bindings_stubs_gen.c:43:19: error: initialization of 'intptr_t' {aka 'long int'} from 'struct scm_unused_struct *' makes integer from pointer without a cast [-Wint-conversion]
- 43 | intptr_t v = (SCM_EOL);
- | ^
- bindings_stubs_gen.c:49:38: warning: cast from pointer to integer of different size [-Wpointer-to-int-cast]
- 49 | enum { check_SCM_BOOL_T_const = (int)SCM_BOOL_T };
- | ^
- bindings_stubs_gen.c:50:19: error: initialization of 'intptr_t' {aka 'long int'} from 'struct scm_unused_struct *' makes integer from pointer without a cast [-Wint-conversion]
- 50 | intptr_t v = (SCM_BOOL_T);
- | ^
- bindings_stubs_gen.c:56:38: warning: cast from pointer to integer of different size [-Wpointer-to-int-cast]
- 56 | enum { check_SCM_BOOL_F_const = (int)SCM_BOOL_F };
- | ^
- bindings_stubs_gen.c:57:19: error: initialization of 'intptr_t' {aka 'long int'} from 'struct scm_unused_struct *' makes integer from pointer without a cast [-Wint-conversion]
- 57 | intptr_t v = (SCM_BOOL_F);
- | ^
[ERROR] The compilation of guile.1.0 failed at "dune build -p guile -j 39 --promote-install-files=false @install".
build failed...
=== STDERR ===
2026-10-02 00:41.56: FAILED: build guile.1.0
2026-10-02 00:41.56: Job failed: build failed: guile.1.0