Build:
  1. 0
2026-10-02 01:25.23: New job: build mysql8.1.0 (36432b8d0178)
2026-10-02 01:25.23: Waiting for resource in pool day11-builds
2026-10-02 01:32.31: Got resource from pool day11-builds
2026-10-02 01:32.31: [profile oxcaml-odoc-master] build mysql8.1.0
2026-10-02 01:32.32: build mysql8.1.0 (36432b8d0178)
=== DEPENDENCIES (43 transitive) ===
  base.v0.18~preview.130.106+341                     0b00d1f69090
  base-threads.base                                  ddcab511c589
  base-unix.base                                     742554e1dbc2
  base_internalhash_types.v0.18~preview.130.106+341  7ca38d487be8
  basement.v0.18~preview.130.106+341                 974f1514a067
  capsule0.v0.18~preview.130.106+341                 117fe09c7440
  conf-autoconf.1                                    43fe4a407b7a
  conf-mysql.1                                       cf462c2f5398
  conf-which.1                                       5fccb3a41099
  csexp.1.5.2                                        a9d3fd6f82d9
  dune.3.22.2+ox                                     a2ef013eeea9
  dune-configurator.3.22.2+ox                        dea98c56dd29
  jane-street-headers.v0.18~preview.130.106+341      f7e5ca762ed1
  jst-config.v0.18~preview.130.106+341               a21544e867d1
  nonempty_list_type.v0.18~preview.130.106+341       1ee66e605264
  ocaml.5.2.0                                        cda6777ccfe3
  ocaml-compiler-libs.v0.17.0+ox                     c80aba262c43
  ocaml-config.3                                     d77b853eaa33
  ocaml-variants.5.2.0+ox                            a9808a9375cd
  ocaml_intrinsics_kernel.v0.18~preview.130.106+341  59e633b60c98
  oxcaml-compiler.5.2.0minus39                       9c94ae342626
  ppx_array_base.v0.18~preview.130.106+341           5ee0516a8b3f
  ppx_assert.v0.18~preview.130.106+341               41ae0b3c445d
  ppx_base.v0.18~preview.130.106+341                 56482540038b
  ppx_compare.v0.18~preview.130.106+341              b1c27a1ff1aa
  ppx_derivers.1.2.1                                 bfa8af8a2975
  ppx_enumerate.v0.18~preview.130.106+341            f13b02bba837
  ppx_globalize.v0.18~preview.130.106+341            ba2bb7f46dee
  ppx_hash.v0.18~preview.130.106+341                 1acaa91e4b9c
  ppx_helpers.v0.18~preview.130.106+341              1480dc0f2b8f
  ppx_here.v0.18~preview.130.106+341                 0fb8a03831fe
  ppx_inline_test.v0.18~preview.130.106+341          6c58a80fed41
  ppx_optcomp.v0.18~preview.130.106+341              27d1933df551
  ppx_sexp_conv.v0.18~preview.130.106+341            47cc995adb60
  ppx_shorthand.v0.18~preview.130.106+341            2c3677f9d065
  ppx_template.v0.18~preview.130.106+341             1fee223d4751
  ppxlib.0.33.0+ox2                                  a8c22dcd95e4
  ppxlib_ast.0.33.0+ox2                              208c0a263aea
  ppxlib_jane.v0.18~preview.130.106+341              f193b6e88a9a
  sexp_type.v0.18~preview.130.106+341                365b308b7069
  sexplib0.v0.18~preview.130.106+341                 681b43b3334e
  stdlib-shims.0.3.0                                 872ba8883981
  time_now.v0.18~preview.130.106+341                 0209cdcd5041
=== STDOUT ===
Processing: [default: loading data]
[mysql8.1.0: dl]
[mysql8.1.0: extract]
-> retrieved mysql8.1.0  (https://opam.ocaml.org/cache)
[mysql8: dune build]
+ /home/opam/.opam/default/bin/dune "build" "-p" "mysql8" "-j" "39" (CWD=/home/opam/.opam/default/.opam-switch/build/mysql8.1.0)
- File "lib/dune", line 4, characters 10-22:
- 4 |  (c_names mysql8_stubs)
-               ^^^^^^^^^^^^
- (cd _build/default/lib && /usr/bin/gcc -O2 -fno-strict-aliasing -fwrapv -pthread -fPIC -pthread -D_FILE_OFFSET_BITS=64 -g -I /home/opam/.opam/default/lib/ocaml -I /home/opam/.opam/default/lib/base -I /home/opam/.opam/default/lib/base/shadow_stdlib -I /home/opam/.opam/default/lib/base_internalhash_types -I /home/opam/.opam/default/lib/basement -I /home/opam/.opam/default/lib/capsule0/prim -I /home/opam/.opam/default/lib/jane-street-headers -I /home/opam/.opam/default/lib/nonempty_list_type -I /home/opam/.opam/default/lib/ocaml_intrinsics_kernel -I /home/opam/.opam/default/lib/ppx_compare/runtime-lib -I /home/opam/.opam/default/lib/ppx_enumerate/runtime-lib -I /home/opam/.opam/default/lib/ppx_hash/runtime-lib -I /home/opam/.opam/default/lib/ppx_inline_test/config -I /home/opam/.opam/default/lib/ppx_inline_test/runtime-lib -I /home/opam/.opam/default/lib/ppx_sexp_conv/runtime-lib -I /home/opam/.opam/default/lib/sexp_type -I /home/opam/.opam/default/lib/sexp_type/grammar -I /home/opam/.opam/default/lib/sexplib0 -I /home/opam/.opam/default/lib/time_now -o mysql8_stubs.o -c mysql8_stubs.c)
- mysql8_stubs.c:38:10: fatal error: mysql.h: No such file or directory
-    38 | #include <mysql.h>
-       |          ^~~~~~~~~
- compilation terminated.
- (cd _build/default && /home/opam/.opam/default/bin/ocamlc.opt -w -40 -g -bin-annot -bin-annot-occurrences -bin-annot-cms -I lib/.mysql8.objs/byte -I /home/opam/.opam/default/lib/base -I /home/opam/.opam/default/lib/base/shadow_stdlib -I /home/opam/.opam/default/lib/base_internalhash_types -I /home/opam/.opam/default/lib/basement -I /home/opam/.opam/default/lib/capsule0/prim -I /home/opam/.opam/default/lib/jane-street-headers -I /home/opam/.opam/default/lib/nonempty_list_type -I /home/opam/.opam/default/lib/ocaml_intrinsics_kernel -I /home/opam/.opam/default/lib/ppx_compare/runtime-lib -I /home/opam/.opam/default/lib/ppx_enumerate/runtime-lib -I /home/opam/.opam/default/lib/ppx_hash/runtime-lib -I /home/opam/.opam/default/lib/ppx_inline_test/config -I /home/opam/.opam/default/lib/ppx_inline_test/runtime-lib -I /home/opam/.opam/default/lib/ppx_sexp_conv/runtime-lib -I /home/opam/.opam/default/lib/sexp_type -I /home/opam/.opam/default/lib/sexp_type/grammar -I /home/opam/.opam/default/lib/sexplib0 -I /home/opam/.opam/default/lib/time_now -cmi-file lib/.mysql8.objs/byte/mysql8.cmi -no-alias-deps -o lib/.mysql8.objs/byte/mysql8.cmo -c -impl lib/mysql8.pp.ml)
- File "lib/mysql8.ml", line 34, characters 8-35:
- 34 | let _ = Callback.register_exception "mysql error" (Error "Registering Callback")
-              ^^^^^^^^^^^^^^^^^^^^^^^^^^^
- Alert unsafe_multidomain: Stdlib.Callback.register_exception
- Use [Callback.Safe.register_exception].
- (cd _build/default && /home/opam/.opam/default/bin/ocamlopt.opt -w -40 -g -I lib/.mysql8.objs/byte -I lib/.mysql8.objs/native -I /home/opam/.opam/default/lib/base -I /home/opam/.opam/default/lib/base/shadow_stdlib -I /home/opam/.opam/default/lib/base_internalhash_types -I /home/opam/.opam/default/lib/basement -I /home/opam/.opam/default/lib/capsule0/prim -I /home/opam/.opam/default/lib/jane-street-headers -I /home/opam/.opam/default/lib/nonempty_list_type -I /home/opam/.opam/default/lib/ocaml_intrinsics_kernel -I /home/opam/.opam/default/lib/ppx_compare/runtime-lib -I /home/opam/.opam/default/lib/ppx_enumerate/runtime-lib -I /home/opam/.opam/default/lib/ppx_hash/runtime-lib -I /home/opam/.opam/default/lib/ppx_inline_test/config -I /home/opam/.opam/default/lib/ppx_inline_test/runtime-lib -I /home/opam/.opam/default/lib/ppx_sexp_conv/runtime-lib -I /home/opam/.opam/default/lib/sexp_type -I /home/opam/.opam/default/lib/sexp_type/grammar -I /home/opam/.opam/default/lib/sexplib0 -I /home/opam/.opam/default/lib/time_now -cmi-file lib/.mysql8.objs/byte/mysql8.cmi -no-alias-deps -o lib/.mysql8.objs/native/mysql8.cmx -c -impl lib/mysql8.pp.ml)
- File "lib/mysql8.ml", line 34, characters 8-35:
- 34 | let _ = Callback.register_exception "mysql error" (Error "Registering Callback")
-              ^^^^^^^^^^^^^^^^^^^^^^^^^^^
- Alert unsafe_multidomain: Stdlib.Callback.register_exception
- Use [Callback.Safe.register_exception].
[ERROR] The compilation of mysql8.1.0 failed at "dune build -p mysql8 -j 39".
build failed... 

=== STDERR ===

2026-10-02 01:32.46: FAILED: build mysql8.1.0
2026-10-02 01:32.46: Job failed: build failed: mysql8.1.0