Build:
- 0
2026-10-02 02:40.41: New job: build randoml.0.1.5 (a63a90b72910)
2026-10-02 02:40.41: Waiting for resource in pool day11-builds
2026-10-02 02:41.54: Got resource from pool day11-builds
2026-10-02 02:41.54: [profile oxcaml-odoc-master] build randoml.0.1.5
2026-10-02 02:41.54: build randoml.0.1.5 (a63a90b72910)
=== DEPENDENCIES (105 transitive) ===
astring.0.8.5 b44ebb6673e9
base.v0.18~preview.130.106+341 0b00d1f69090
base-threads.base ddcab511c589
base-unix.base 742554e1dbc2
base_bigstring.v0.18~preview.130.106+341 adc2c4f9ed01
base_internalhash_types.v0.18~preview.130.106+341 7ca38d487be8
base_quickcheck.v0.18~preview.130.106+341 9a8ebb204fac
basement.v0.18~preview.130.106+341 974f1514a067
bignum.v0.18~preview.130.106+341 cc75d4bf1ce7
bin_prot.v0.18~preview.130.106+341 994d334411aa
camlp-streams.5.0.1 3a541441f2a0
capitalization.v0.18~preview.130.106+341 599f14df0b6f
capsule.v0.18~preview.130.106+341 254d268cae7d
capsule0.v0.18~preview.130.106+341 117fe09c7440
conf-autoconf.1 43fe4a407b7a
conf-gmp.5 00570d20295f
conf-rust-2018.1 dfb5bca605e0
conf-which.1 5fccb3a41099
core.v0.18~preview.130.106+341 b4880a2a91e5
core_kernel.v0.18~preview.130.106+341 781db8aeb249
csexp.1.5.2 a9d3fd6f82d9
dune.3.22.2+ox a2ef013eeea9
dune-configurator.3.22.2+ox dea98c56dd29
fieldslib.v0.18~preview.130.106+341 5187fad717bb
int_repr.v0.18~preview.130.106+341 ef6d34ef210d
jane-street-headers.v0.18~preview.130.106+341 f7e5ca762ed1
jst-config.v0.18~preview.130.106+341 a21544e867d1
nonempty_list_type.v0.18~preview.130.106+341 1ee66e605264
num.1.6 da35670984d3
ocaml.5.2.0 cda6777ccfe3
ocaml-compiler-libs.v0.17.0+ox c80aba262c43
ocaml-config.3 d77b853eaa33
ocaml-variants.5.2.0+ox a9808a9375cd
ocaml_intrinsics_kernel.v0.18~preview.130.106+341 59e633b60c98
ocamlbuild.0.16.1+ox 63a719bfd385
ocamlfind.1.9.8+ox f23a347b8f5f
odoc-parser.3.2.1+master.1790607351.6dc5826 5374e5d0266d
oxcaml-compiler.5.2.0minus39 9c94ae342626
parsexp.v0.18~preview.130.106+341 8d7b1681609c
portable.v0.18~preview.130.106+341 5deb84682f01
ppx_array_base.v0.18~preview.130.106+341 5ee0516a8b3f
ppx_assert.v0.18~preview.130.106+341 41ae0b3c445d
ppx_base.v0.18~preview.130.106+341 56482540038b
ppx_bench.v0.18~preview.130.106+341 c5e33cd97d47
ppx_bin_prot.v0.18~preview.130.106+341 f4a2fc895df8
ppx_compare.v0.18~preview.130.106+341 b1c27a1ff1aa
ppx_custom_printf.v0.18~preview.130.106+341 0bc30b1c9530
ppx_debug_assert.v0.18~preview.130.106+341 0474b08e5348
ppx_derivers.1.2.1 bfa8af8a2975
ppx_diff.v0.18~preview.130.106+341 6f8acb466a79
ppx_disable_unused_warnings.v0.18~preview.130.106+341 edcf734d01cb
ppx_enumerate.v0.18~preview.130.106+341 f13b02bba837
ppx_expect.v0.18~preview.130.106+341 e787d2cfc771
ppx_fields_conv.v0.18~preview.130.106+341 ea8085eda6c8
ppx_fixed_literal.v0.18~preview.130.106+341 ce4a0726d941
ppx_fuelproof.v0.18~preview.130.106+341 f81c071e4526
ppx_globalize.v0.18~preview.130.106+341 ba2bb7f46dee
ppx_hash.v0.18~preview.130.106+341 1acaa91e4b9c
ppx_helpers.v0.18~preview.130.106+341 1480dc0f2b8f
ppx_here.v0.18~preview.130.106+341 0fb8a03831fe
ppx_ignore_instrumentation.v0.18~preview.130.106+341 19e639b655bf
ppx_inline_test.v0.18~preview.130.106+341 6c58a80fed41
ppx_int63_literal.v0.18~preview.130.106+341 4369ab0747f1
ppx_jane.v0.18~preview.130.106+341 9ee2e26c26ab
ppx_js_style.v0.18~preview.130.106+341 92138b6a04ae
ppx_let.v0.18~preview.130.106+341 07d2ffcd4518
ppx_log.v0.18~preview.130.106+341 e7a4fe17cfef
ppx_module_timer.v0.18~preview.130.106+341 9ed3f4f6a559
ppx_optcomp.v0.18~preview.130.106+341 27d1933df551
ppx_optional.v0.18~preview.130.106+341 b68b475c3e60
ppx_pipebang.v0.18~preview.130.106+341 b63a0e4c918c
ppx_portable.v0.18~preview.130.106+341 bf63b4c3946c
ppx_sexp_conv.v0.18~preview.130.106+341 47cc995adb60
ppx_sexp_message.v0.18~preview.130.106+341 1ba32ae70be8
ppx_sexp_value.v0.18~preview.130.106+341 0149ddac1f85
ppx_shorthand.v0.18~preview.130.106+341 2c3677f9d065
ppx_stable.v0.18~preview.130.106+341 373f727647e9
ppx_stable_witness.v0.18~preview.130.106+341 a316560229f8
ppx_string.v0.18~preview.130.106+341 8942ce8db4f0
ppx_string_conv.v0.18~preview.130.106+341 505a0b98b971
ppx_template.v0.18~preview.130.106+341 1fee223d4751
ppx_tydi.v0.18~preview.130.106+341 22f907dba74b
ppx_typed_fields.v0.18~preview.130.106+341 91f108ace9df
ppx_typerep_conv.v0.18~preview.130.106+341 19ede16d2ca7
ppx_var_name.v0.18~preview.130.106+341 f1dfe18f65ff
ppx_variants_conv.v0.18~preview.130.106+341 16a4b33b8e1d
ppxlib.0.33.0+ox2 a8c22dcd95e4
ppxlib_ast.0.33.0+ox2 208c0a263aea
ppxlib_jane.v0.18~preview.130.106+341 f193b6e88a9a
sexp_type.v0.18~preview.130.106+341 365b308b7069
sexplib.v0.18~preview.130.106+341 f0d968bdeba3
sexplib0.v0.18~preview.130.106+341 681b43b3334e
splittable_random.v0.18~preview.130.106+341 bf4aff9ee4c2
stdio.v0.18~preview.130.106+341 13ea52fb291c
stdlib-shims.0.3.0 872ba8883981
string_dict.v0.18~preview.130.106+341 6a3525e09e50
time_now.v0.18~preview.130.106+341 0209cdcd5041
topkg.1.1.1+ox 12497656aa9b
typerep.v0.18~preview.130.106+341 9b795638b015
unique.v0.18~preview.130.106+341 13aef6cb7511
univ_map.v0.18~preview.130.106+341 dab934e75a6c
uopt.v0.18~preview.130.106+341 9f8fc8d9dd75
variantslib.v0.18~preview.130.106+341 5a3b741ab5ef
zarith.1.12+ox3 f6ec0c6300f3
zarith_stubs_js.v0.18~preview.130.106+341 7294da259fd6
=== STDOUT ===
Processing: [default: loading data]
[randoml.0.1.5: dl]
[randoml.0.1.5: extract]
-> retrieved randoml.0.1.5 (https://opam.ocaml.org/cache)
[randoml: dune build]
+ /home/opam/.opam/default/bin/dune "build" "-p" "randoml" "-j" "39" "@install" (CWD=/home/opam/.opam/default/.opam-switch/build/randoml.0.1.5)
- (cd _build/default && /home/opam/.opam/default/bin/ocamlc.opt -w -40 -g -bin-annot -bin-annot-occurrences -bin-annot-cms -I lib/.randoml.objs/byte -I /home/opam/.opam/default/lib/base -I /home/opam/.opam/default/lib/base/md5 -I /home/opam/.opam/default/lib/base/shadow_stdlib -I /home/opam/.opam/default/lib/base_bigstring -I /home/opam/.opam/default/lib/base_internalhash_types -I /home/opam/.opam/default/lib/base_quickcheck -I /home/opam/.opam/default/lib/base_quickcheck/ppx_quickcheck/runtime -I /home/opam/.opam/default/lib/basement -I /home/opam/.opam/default/lib/bignum/bigint -I /home/opam/.opam/default/lib/bin_prot -I /home/opam/.opam/default/lib/bin_prot/shape -I /home/opam/.opam/default/lib/capsule -I /home/opam/.opam/default/lib/capsule0/blocking_sync -I /home/opam/.opam/default/lib/capsule0/prim -I /home/opam/.opam/default/lib/core -I /home/opam/.opam/default/lib/core/base_for_tests -I /home/opam/.opam/default/lib/core/command -I /home/opam/.opam/default/lib/core/filename_base -I /home/opam/.opam/default/lib/core/heap_block -I /home/opam/.opam/default/lib/core/validate -I /home/opam/.opam/default/lib/core_kernel -I /home/opam/.opam/default/lib/fieldslib -I /home/opam/.opam/default/lib/int_repr -I /home/opam/.opam/default/lib/jane-street-headers -I /home/opam/.opam/default/lib/nonempty_list_type -I /home/opam/.opam/default/lib/num -I /home/opam/.opam/default/lib/ocaml_intrinsics_kernel -I /home/opam/.opam/default/lib/parsexp -I /home/opam/.opam/default/lib/portable -I /home/opam/.opam/default/lib/portable/common -I /home/opam/.opam/default/lib/portable/kernel -I /home/opam/.opam/default/lib/ppx_assert/runtime-lib -I /home/opam/.opam/default/lib/ppx_bench/config -I /home/opam/.opam/default/lib/ppx_bench/config_types -I /home/opam/.opam/default/lib/ppx_bench/runtime-lib -I /home/opam/.opam/default/lib/ppx_compare/runtime-lib -I /home/opam/.opam/default/lib/ppx_diff/diffable -I /home/opam/.opam/default/lib/ppx_diff/diffable_cinaps -I /home/opam/.opam/default/lib/ppx_enumerate/runtime-lib -I /home/opam/.opam/default/lib/ppx_expect/config -I /home/opam/.opam/default/lib/ppx_expect/config_types -I /home/opam/.opam/default/lib/ppx_expect/make_corrected_file -I /home/opam/.opam/default/lib/ppx_expect/make_corrected_file_kernel -I /home/opam/.opam/default/lib/ppx_expect/runtime -I /home/opam/.opam/default/lib/ppx_expect/runtime_types -I /home/opam/.opam/default/lib/ppx_fuelproof/runtime -I /home/opam/.opam/default/lib/ppx_hash/runtime-lib -I /home/opam/.opam/default/lib/ppx_here/runtime-lib -I /home/opam/.opam/default/lib/ppx_inline_test/config -I /home/opam/.opam/default/lib/ppx_inline_test/runtime-lib -I /home/opam/.opam/default/lib/ppx_log/syntax -I /home/opam/.opam/default/lib/ppx_log/types -I /home/opam/.opam/default/lib/ppx_module_timer/runtime -I /home/opam/.opam/default/lib/ppx_portable/runtime -I /home/opam/.opam/default/lib/ppx_sexp_conv/runtime-lib -I /home/opam/.opam/default/lib/ppx_stable_witness/runtime -I /home/opam/.opam/default/lib/ppx_stable_witness/stable_witness -I /home/opam/.opam/default/lib/ppx_string/runtime -I /home/opam/.opam/default/lib/ppx_string_conv/runtime -I /home/opam/.opam/default/lib/ppx_typed_fields/typed_fields_lib -I /home/opam/.opam/default/lib/ppx_typed_fields/typed_variants_lib -I /home/opam/.opam/default/lib/ppxlib/print_diff -I /home/opam/.opam/default/lib/ppxlib/stdppx -I /home/opam/.opam/default/lib/ppxlib_ast/stdppx -I /home/opam/.opam/default/lib/sexp_type -I /home/opam/.opam/default/lib/sexp_type/grammar -I /home/opam/.opam/default/lib/sexplib -I /home/opam/.opam/default/lib/sexplib0 -I /home/opam/.opam/default/lib/splittable_random -I /home/opam/.opam/default/lib/stdio -I /home/opam/.opam/default/lib/stdlib-shims -I /home/opam/.opam/default/lib/string_dict -I /home/opam/.opam/default/lib/time_now -I /home/opam/.opam/default/lib/typerep -I /home/opam/.opam/default/lib/unique -I /home/opam/.opam/default/lib/univ_map -I /home/opam/.opam/default/lib/variantslib -I /home/opam/.opam/default/lib/zarith -I /home/opam/.opam/default/lib/zarith_stubs_js -I lib/rand/.rand.objs/byte -cmi-file lib/.randoml.objs/byte/randoml.cmi -no-alias-deps -o lib/.randoml.objs/byte/randoml.cmo -c -impl lib/randoml.pp.ml)
- File "lib/randoml.ml", line 1, characters 5-16:
- 1 | open Core_kernel
- ^^^^^^^^^^^
- Alert deprecated: module Core_kernel
- [since 2021-05] Use [Core] -- [Core_kernel] was renamed as [Core]
- (cd _build/default && /home/opam/.opam/default/bin/ocamlopt.opt -w -40 -g -I lib/.randoml.objs/byte -I lib/.randoml.objs/native -I /home/opam/.opam/default/lib/base -I /home/opam/.opam/default/lib/base/md5 -I /home/opam/.opam/default/lib/base/shadow_stdlib -I /home/opam/.opam/default/lib/base_bigstring -I /home/opam/.opam/default/lib/base_internalhash_types -I /home/opam/.opam/default/lib/base_quickcheck -I /home/opam/.opam/default/lib/base_quickcheck/ppx_quickcheck/runtime -I /home/opam/.opam/default/lib/basement -I /home/opam/.opam/default/lib/bignum/bigint -I /home/opam/.opam/default/lib/bin_prot -I /home/opam/.opam/default/lib/bin_prot/shape -I /home/opam/.opam/default/lib/capsule -I /home/opam/.opam/default/lib/capsule0/blocking_sync -I /home/opam/.opam/default/lib/capsule0/prim -I /home/opam/.opam/default/lib/core -I /home/opam/.opam/default/lib/core/base_for_tests -I /home/opam/.opam/default/lib/core/command -I /home/opam/.opam/default/lib/core/filename_base -I /home/opam/.opam/default/lib/core/heap_block -I /home/opam/.opam/default/lib/core/validate -I /home/opam/.opam/default/lib/core_kernel -I /home/opam/.opam/default/lib/fieldslib -I /home/opam/.opam/default/lib/int_repr -I /home/opam/.opam/default/lib/jane-street-headers -I /home/opam/.opam/default/lib/nonempty_list_type -I /home/opam/.opam/default/lib/num -I /home/opam/.opam/default/lib/ocaml_intrinsics_kernel -I /home/opam/.opam/default/lib/parsexp -I /home/opam/.opam/default/lib/portable -I /home/opam/.opam/default/lib/portable/common -I /home/opam/.opam/default/lib/portable/kernel -I /home/opam/.opam/default/lib/ppx_assert/runtime-lib -I /home/opam/.opam/default/lib/ppx_bench/config -I /home/opam/.opam/default/lib/ppx_bench/config_types -I /home/opam/.opam/default/lib/ppx_bench/runtime-lib -I /home/opam/.opam/default/lib/ppx_compare/runtime-lib -I /home/opam/.opam/default/lib/ppx_diff/diffable -I /home/opam/.opam/default/lib/ppx_diff/diffable_cinaps -I /home/opam/.opam/default/lib/ppx_enumerate/runtime-lib -I /home/opam/.opam/default/lib/ppx_expect/config -I /home/opam/.opam/default/lib/ppx_expect/config_types -I /home/opam/.opam/default/lib/ppx_expect/make_corrected_file -I /home/opam/.opam/default/lib/ppx_expect/make_corrected_file_kernel -I /home/opam/.opam/default/lib/ppx_expect/runtime -I /home/opam/.opam/default/lib/ppx_expect/runtime_types -I /home/opam/.opam/default/lib/ppx_fuelproof/runtime -I /home/opam/.opam/default/lib/ppx_hash/runtime-lib -I /home/opam/.opam/default/lib/ppx_here/runtime-lib -I /home/opam/.opam/default/lib/ppx_inline_test/config -I /home/opam/.opam/default/lib/ppx_inline_test/runtime-lib -I /home/opam/.opam/default/lib/ppx_log/syntax -I /home/opam/.opam/default/lib/ppx_log/types -I /home/opam/.opam/default/lib/ppx_module_timer/runtime -I /home/opam/.opam/default/lib/ppx_portable/runtime -I /home/opam/.opam/default/lib/ppx_sexp_conv/runtime-lib -I /home/opam/.opam/default/lib/ppx_stable_witness/runtime -I /home/opam/.opam/default/lib/ppx_stable_witness/stable_witness -I /home/opam/.opam/default/lib/ppx_string/runtime -I /home/opam/.opam/default/lib/ppx_string_conv/runtime -I /home/opam/.opam/default/lib/ppx_typed_fields/typed_fields_lib -I /home/opam/.opam/default/lib/ppx_typed_fields/typed_variants_lib -I /home/opam/.opam/default/lib/ppxlib/print_diff -I /home/opam/.opam/default/lib/ppxlib/stdppx -I /home/opam/.opam/default/lib/ppxlib_ast/stdppx -I /home/opam/.opam/default/lib/sexp_type -I /home/opam/.opam/default/lib/sexp_type/grammar -I /home/opam/.opam/default/lib/sexplib -I /home/opam/.opam/default/lib/sexplib0 -I /home/opam/.opam/default/lib/splittable_random -I /home/opam/.opam/default/lib/stdio -I /home/opam/.opam/default/lib/stdlib-shims -I /home/opam/.opam/default/lib/string_dict -I /home/opam/.opam/default/lib/time_now -I /home/opam/.opam/default/lib/typerep -I /home/opam/.opam/default/lib/unique -I /home/opam/.opam/default/lib/univ_map -I /home/opam/.opam/default/lib/variantslib -I /home/opam/.opam/default/lib/zarith -I /home/opam/.opam/default/lib/zarith_stubs_js -I lib/rand/.rand.objs/byte -I lib/rand/.rand.objs/native -cmi-file lib/.randoml.objs/byte/randoml.cmi -no-alias-deps -o lib/.randoml.objs/native/randoml.cmx -c -impl lib/randoml.pp.ml)
- File "lib/randoml.ml", line 1, characters 5-16:
- 1 | open Core_kernel
- ^^^^^^^^^^^
- Alert deprecated: module Core_kernel
- [since 2021-05] Use [Core] -- [Core_kernel] was renamed as [Core]
- File "lib/rand/dune", lines 7-26, characters 0-671:
- 7 | (rule
- 8 | (targets librand.a dllrand.so)
- 9 | (deps
- ....
- 24 | -c
- 25 | "mv target/release/librand.so ./dllrand.so 2> /dev/null || mv target/release/librand.dylib ./dllrand.so 2> /dev/null || touch dllrand.so")
- 26 | (run cp target/release/librand.a .))))
- (cd _build/default/lib/rand && /usr/bin/cargo build --release --offline)
- Compiling proc-macro2 v1.0.27
- Compiling unicode-xid v0.2.2
- Compiling libc v0.2.97
- Compiling syn v1.0.73
- Compiling cc v1.0.68
- Compiling cfg-if v1.0.0
- Compiling ocaml-sys v0.20.1
- Compiling cty v0.2.1
- Compiling ocaml-sys v0.22.0
- Compiling static_assertions v1.1.0
- Compiling chlorine v1.0.7
- Compiling ppv-lite86 v0.2.10
- Compiling quote v1.0.9
- Compiling getrandom v0.2.3
- Compiling rand_core v0.6.3
- Compiling rand_chacha v0.3.1
- Compiling ocaml-boxroot-sys v0.2.0
- Compiling rand v0.8.4
- warning: ocaml-boxroot-sys@0.2.0: vendor/boxroot/boxroot.c:23:10: fatal error: caml/compact.h: No such file or directory
- warning: ocaml-boxroot-sys@0.2.0: 23 | #include <caml/compact.h>
- warning: ocaml-boxroot-sys@0.2.0: | ^~~~~~~~~~~~~~~~
- warning: ocaml-boxroot-sys@0.2.0: compilation terminated.
- error: failed to run custom build command for `ocaml-boxroot-sys v0.2.0`
-
- Caused by:
- process didn't exit successfully: `/home/opam/.opam/default/.opam-switch/build/randoml.0.1.5/_build/default/lib/rand/target/release/build/ocaml-boxroot-sys-6f7441702399e165/build-script-build` (exit status: 1)
- --- stdout
- cargo:rerun-if-changed=vendor/boxroot/boxroot.c
- cargo:rerun-if-changed=vendor/boxroot/boxroot.h
- cargo:rerun-if-env-changed=OCAMLOPT
- cargo:rerun-if-env-changed=OCAML_WHERE_PATH
- TARGET = Some("x86_64-unknown-linux-gnu")
- OPT_LEVEL = Some("3")
- HOST = Some("x86_64-unknown-linux-gnu")
- CC_x86_64-unknown-linux-gnu = None
- CC_x86_64_unknown_linux_gnu = None
- HOST_CC = None
- CC = None
- CFLAGS_x86_64-unknown-linux-gnu = None
- CFLAGS_x86_64_unknown_linux_gnu = None
- HOST_CFLAGS = None
- CFLAGS = None
- CRATE_CC_NO_DEFAULTS = None
- DEBUG = Some("false")
- CARGO_CFG_TARGET_FEATURE = Some("fxsr,sse,sse2")
- running: "cc" "-O3" "-ffunction-sections" "-fdata-sections" "-fPIC" "-m64" "-I" "/home/opam/.opam/default/lib/ocaml" "-I" "vendor/boxroot/" "-Wall" "-Wextra" "-o" "/home/opam/.opam/default/.opam-switch/build/randoml.0.1.5/_build/default/lib/rand/target/release/build/ocaml-boxroot-sys-27e7b736356b61c0/out/vendor/boxroot/boxroot.o" "-c" "vendor/boxroot/boxroot.c"
- cargo:warning=vendor/boxroot/boxroot.c:23:10: fatal error: caml/compact.h: No such file or directory
- cargo:warning= 23 | #include <caml/compact.h>
- cargo:warning= | ^~~~~~~~~~~~~~~~
- cargo:warning=compilation terminated.
- exit status: 1
-
- --- stderr
-
-
- error occurred: Command "cc" "-O3" "-ffunction-sections" "-fdata-sections" "-fPIC" "-m64" "-I" "/home/opam/.opam/default/lib/ocaml" "-I" "vendor/boxroot/" "-Wall" "-Wextra" "-o" "/home/opam/.opam/default/.opam-switch/build/randoml.0.1.5/_build/default/lib/rand/target/release/build/ocaml-boxroot-sys-27e7b736356b61c0/out/vendor/boxroot/boxroot.o" "-c" "vendor/boxroot/boxroot.c" with args "cc" did not execute successfully (status code exit status: 1).
-
-
- warning: build failed, waiting for other jobs to finish...
[ERROR] The compilation of randoml.0.1.5 failed at "dune build -p randoml -j 39 @install".
build failed...
=== STDERR ===
2026-10-02 02:42.37: FAILED: build randoml.0.1.5
2026-10-02 02:42.37: Job failed: build failed: randoml.0.1.5