Build:
- 0
2026-10-06 16:44.58: New job: build conf-opencc1.1 (b18d17dd6928) 2026-10-06 16:44.58: Waiting for resource in pool day11-builds 2026-10-06 16:45.13: Got resource from pool day11-builds 2026-10-06 16:45.13: [profile oxcaml-odoc-master] build conf-opencc1.1 2026-10-06 16:45.30: build conf-opencc1.1 (b18d17dd6928) === DEPENDENCIES (0 transitive) === === STDOUT === Processing: [default: loading data] [WARNING] These additional system packages are required, but not available on your system: libopencc2 [conf-opencc1.1/test.c: dl] -> retrieved conf-opencc1.1 (https://opam.ocaml.org/cache) [conf-opencc1: sh cc $CFLAGS test.c -l:libopencc.so.2] + /usr/bin/sh "-exec" "cc $CFLAGS test.c -l:libopencc.so.2" (CWD=/home/opam/.opam/default/.opam-switch/build/conf-opencc1.1) [ERROR] The compilation of conf-opencc1.1 failed at "sh -exec cc $CFLAGS test.c -l:libopencc.so.2". - + cc test.c -l:libopencc.so.2 - /usr/bin/ld: cannot find -l:libopencc.so.2: No such file or directory - collect2: error: ld returned 1 exit status build failed... === STDERR === 2026-10-06 16:45.34: FAILED: build conf-opencc1.1 2026-10-06 16:45.34: Job failed: build failed: conf-opencc1.1