Build:
- 0
2026-10-06 17:04.20: New job: build metapp.0.4.4 (bdc007531b02)
2026-10-06 17:04.20: Waiting for resource in pool day11-builds
2026-10-06 17:06.45: Got resource from pool day11-builds
2026-10-06 17:06.45: [profile odoc-master-mini] build metapp.0.4.4
2026-10-06 17:06.45: build metapp.0.4.4 (bdc007531b02)
=== DEPENDENCIES (14 transitive) ===
base-threads.base 464810371b96
base-unix.base 4596d20d2cf7
dune.3.24.2 d19384e8cf2e
ocaml.5.3.0 f83afbdc13ff
ocaml-base-compiler.5.3.0 7ab5720b08a0
ocaml-compiler.5.3.0 8c471d8727c3
ocaml-compiler-libs.v0.17.0 252462c035cd
ocaml-config.3 bcfdc9e1b632
ocamlfind.1.9.8 770fc794f4f3
ppx_derivers.1.2.1 bad0b3439977
ppxlib.0.35.0 8c6eff9cebd2
sexplib0.v0.17.0 299115d5d98f
stdcompat.21.1 001d2996d465
stdlib-shims.0.3.0 c72c25c681ad
=== STDOUT ===
Processing: [default: loading data]
[metapp.0.4.4: dl]
[metapp.0.4.4: extract]
-> retrieved metapp.0.4.4 (https://opam.ocaml.org/cache)
[metapp: dune build]
+ /home/opam/.opam/default/bin/dune "build" "-p" "metapp" "-j" "39" "@install" (CWD=/home/opam/.opam/default/.opam-switch/build/metapp.0.4.4)
- (cd _build/default && .ppx/e17850eae66b6b5844e45f672bc501f8/ppx.exe --cookie 'library-name="metapp"' -o metapp/metapp.pp.mli --intf metapp/metapp.mli -corrected-suffix .ppx-corrected -diff-cmd - -dump-ast)
- File "_none_", line 1:
- Warning 58 [no-cmx-file]: no cmx file was found in path for module Metapp_api, and its interface was not compiled with -opaque
-
- File "_none_", line 1:
- Warning 58 [no-cmx-file]: no cmx file was found in path for module Metapp_version_info, and its interface was not compiled with -opaque
- File "_none_", line 1:
- Error: error loading shared library: Failure("/tmp/build_38f829_dune/metapp349bc0.cmxs: failed to map segment from shared object")
- (cd _build/default && .ppx/e17850eae66b6b5844e45f672bc501f8/ppx.exe --cookie 'library-name="metapp"' -o metapp/metapp.pp.ml --impl metapp/metapp.ml -corrected-suffix .ppx-corrected -diff-cmd - -dump-ast)
- File "_none_", line 1:
- Warning 58 [no-cmx-file]: no cmx file was found in path for module Metapp_api, and its interface was not compiled with -opaque
-
- File "_none_", line 1:
- Warning 58 [no-cmx-file]: no cmx file was found in path for module Metapp_preutils, and its interface was not compiled with -opaque
-
- File "_none_", line 1:
- Warning 58 [no-cmx-file]: no cmx file was found in path for module Metapp_version_info, and its interface was not compiled with -opaque
- File "_none_", line 1:
- Error: error loading shared library: Failure("/tmp/build_38f829_dune/metapp65e483.cmxs: failed to map segment from shared object")
[ERROR] The compilation of metapp.0.4.4 failed at "dune build -p metapp -j 39 @install".
build failed...
=== STDERR ===
2026-10-06 17:07.15: FAILED: build metapp.0.4.4
2026-10-06 17:07.15: Job failed: build failed: metapp.0.4.4