Build:
  1. 0
2026-10-06 17:28.58: New job: build conf-cuda.1 (ed63a2f74846)
2026-10-06 17:28.58: Waiting for resource in pool day11-builds
2026-10-06 17:32.03: Got resource from pool day11-builds
2026-10-06 17:32.03: [profile oxcaml-odoc-master] build conf-cuda.1
2026-10-06 17:32.03: build conf-cuda.1 (ed63a2f74846)
=== DEPENDENCIES (7 transitive) ===
  conf-autoconf.1                                    8ee1e3913008
  conf-cuda-config.1                                 98c7b303cbc5
  conf-which.1                                       65c43ca119c3
  ocaml.5.2.0                                        879ae859f814
  ocaml-config.3                                     37112a8040f8
  ocaml-variants.5.2.0+ox                            8119d9341417
  oxcaml-compiler.5.2.0minus39                       72925b65bf23
=== STDOUT ===
Processing: [default: loading data]
[conf-cuda: sh cat <<EOF > test.c
   #include  "cuda.h"
   #include  "nvrtc.h"
   ]
+ /usr/bin/sh "-exc" "cat <<EOF > test.c\n   #include  \"cuda.h\"\n   #include  \"nvrtc.h\"\n   " (CWD=/home/opam/.opam/default/.opam-switch/build/conf-cuda.1)
- + cat
[conf-cuda: sh]
+ /usr/bin/sh "-exc" "$(ocamlc -config-var c_compiler) -c $CFLAGS -I'/usr/local/cuda/include' test.c" (CWD=/home/opam/.opam/default/.opam-switch/build/conf-cuda.1)
- + ocamlc -config-var c_compiler
- + gcc -c -I/usr/local/cuda/include test.c
- test.c:1:14: fatal error: cuda.h: No such file or directory
-     1 |    #include  "cuda.h"
-       |              ^~~~~~~~
- compilation terminated.
[ERROR] The compilation of conf-cuda.1 failed at "sh -exc $(ocamlc -config-var c_compiler) -c $CFLAGS -I'/usr/local/cuda/include' test.c".
build failed... 

=== STDERR ===

2026-10-06 17:32.11: FAILED: build conf-cuda.1
2026-10-06 17:32.11: Job failed: build failed: conf-cuda.1