Build:
- 0
2026-10-06 17:32.25: New job: build tophide.1.0.4 (a6ca7d7297af) 2026-10-06 17:32.25: Waiting for resource in pool day11-builds 2026-10-06 17:36.21: Got resource from pool day11-builds 2026-10-06 17:36.21: [profile oxcaml-odoc-master] build tophide.1.0.4 2026-10-06 17:36.21: build tophide.1.0.4 (a6ca7d7297af) === DEPENDENCIES (7 transitive) === conf-autoconf.1 8ee1e3913008 conf-which.1 65c43ca119c3 ocaml.5.2.0 879ae859f814 ocaml-config.3 37112a8040f8 ocaml-variants.5.2.0+ox 8119d9341417 ocamlfind.1.9.8+ox 665ae3389aa8 oxcaml-compiler.5.2.0minus39 72925b65bf23 === STDOUT === Processing: [default: loading data] [tophide.1.0.4: dl] [tophide.1.0.4: extract] -> retrieved tophide.1.0.4 (https://opam.ocaml.org/cache) [tophide: make] + /usr/bin/make (CWD=/home/opam/.opam/default/.opam-switch/build/tophide.1.0.4) - cat META.in > META - echo 'version = "1.0.4"' >> META - ocamlc -I +compiler-libs -c tophide.ml - File "tophide.ml", line 29, characters 25-46: - 29 | print_out_class_type = !print_out_class_type; - ^^^^^^^^^^^^^^^^^^^^^ - Error: This expression has type - "Outcometree.out_class_type Format_doc.printer" = - "Format_doc.formatter -> Outcometree.out_class_type -> unit" - but an expression was expected of type - "Format.formatter -> Outcometree.out_class_type -> unit" - Type "Format_doc.formatter" is not compatible with type "Format.formatter" - make: *** [Makefile:11: tophide.cmo] Error 2 [ERROR] The compilation of tophide.1.0.4 failed at "make". build failed... === STDERR === 2026-10-06 17:36.37: FAILED: build tophide.1.0.4 2026-10-06 17:36.37: Job failed: build failed: tophide.1.0.4