Build:
- 0
2026-10-06 17:32.25: New job: build termbox.0.1.0 (ed83a8735e66) 2026-10-06 17:32.25: Waiting for resource in pool day11-builds 2026-10-06 17:36.21: Got resource from pool day11-builds 2026-10-06 17:36.21: [profile oxcaml-odoc-master] build termbox.0.1.0 2026-10-06 17:36.21: build termbox.0.1.0 (ed83a8735e66) === DEPENDENCIES (7 transitive) === conf-autoconf.1 8ee1e3913008 conf-which.1 65c43ca119c3 ocaml.5.2.0 879ae859f814 ocaml-config.3 37112a8040f8 ocaml-variants.5.2.0+ox 8119d9341417 ocamlfind.1.9.8+ox 665ae3389aa8 oxcaml-compiler.5.2.0minus39 72925b65bf23 === STDOUT === Processing: [default: loading data] [WARNING] These additional system packages are required, but not available on your system: python [termbox.0.1.0: dl] [termbox.0.1.0: extract] -> retrieved termbox.0.1.0 (https://opam.ocaml.org/cache) [termbox: make] + /usr/bin/make (CWD=/home/opam/.opam/default/.opam-switch/build/termbox.0.1.0) - cd termbox && ./waf configure && ./waf - env: 'python': No such file or directory - make: *** [Makefile:26: termbox/build/src/libtermbox.a] Error 127 [ERROR] The compilation of termbox.0.1.0 failed at "make". build failed... === STDERR === 2026-10-06 17:36.37: FAILED: build termbox.0.1.0 2026-10-06 17:36.37: Job failed: build failed: termbox.0.1.0