Build:
  1. 0
2026-10-06 17:32.25: New job: build inspect.0.2.1 (9289ffc49ce8)
2026-10-06 17:32.25: Waiting for resource in pool day11-builds
2026-10-06 17:36.15: Got resource from pool day11-builds
2026-10-06 17:36.15: [profile oxcaml-odoc-master] build inspect.0.2.1
2026-10-06 17:36.15: build inspect.0.2.1 (9289ffc49ce8)
=== DEPENDENCIES (7 transitive) ===
  conf-autoconf.1                                    8ee1e3913008
  conf-which.1                                       65c43ca119c3
  ocaml.5.2.0                                        879ae859f814
  ocaml-config.3                                     37112a8040f8
  ocaml-variants.5.2.0+ox                            8119d9341417
  ocamlfind.1.9.8+ox                                 665ae3389aa8
  oxcaml-compiler.5.2.0minus39                       72925b65bf23
=== STDOUT ===
Processing: [default: loading data]
[inspect.0.2.1: dl]
[inspect.0.2.1: extract]
-> retrieved inspect.0.2.1  (https://opam.ocaml.org/cache)
[inspect: make]
+ /usr/bin/make  (CWD=/home/opam/.opam/default/.opam-switch/build/inspect.0.2.1)
- make[1]: Entering directory '/home/opam/.opam/default/.opam-switch/build/inspect.0.2.1'
- ocamldep aux.ml > ._d/aux.d
- ocamldep value.ml > ._d/value.d
- ocamldep dot.ml > ._d/dot.d
- ocamldep sexpr.ml > ._d/sexpr.d
- ocamldep -native aux.mli > ._ncdi/aux.di
- OCamlMakefile:1140: warning: pattern recipe did not update peer target '._bcdi/aux.di'.
- ocamldep -native value.mli > ._ncdi/value.di
- OCamlMakefile:1140: warning: pattern recipe did not update peer target '._bcdi/value.di'.
- ocamldep -native dot.mli > ._ncdi/dot.di
- OCamlMakefile:1140: warning: pattern recipe did not update peer target '._bcdi/dot.di'.
- ocamldep -native sexpr.mli > ._ncdi/sexpr.di
- OCamlMakefile:1140: warning: pattern recipe did not update peer target '._bcdi/sexpr.di'.
- ocamlc -c -cc "cc" -ccopt "-fPIC  \
- 			-DPIC -DNATIVE_CODE   \
- 			    -o value_cimpl.o " value_cimpl.c
- ar rcs libinspect_stubs.a  value_cimpl.o
- ocamlc -c -w Aelz aux.mli
- File "_none_", line 1:
- Alert ocaml_deprecated_cli: Setting a warning with a sequence of lowercase or uppercase letters,
- like 'Aelz', is deprecated.
- Use the equivalent signed form: +A-e-l-z.
- Hint: Enabling or disabling a warning by its mnemonic name requires a + or - prefix.
- ocamlopt -c -w Aelz -for-pack Inspect aux.ml
- File "_none_", line 1:
- Alert ocaml_deprecated_cli: Setting a warning with a sequence of lowercase or uppercase letters,
- like 'Aelz', is deprecated.
- Use the equivalent signed form: +A-e-l-z.
- Hint: Enabling or disabling a warning by its mnemonic name requires a + or - prefix.
- ocamlc -c -w Aelz value.mli
- File "_none_", line 1:
- Alert ocaml_deprecated_cli: Setting a warning with a sequence of lowercase or uppercase letters,
- like 'Aelz', is deprecated.
- Use the equivalent signed form: +A-e-l-z.
- Hint: Enabling or disabling a warning by its mnemonic name requires a + or - prefix.
- ocamlopt -c -w Aelz -for-pack Inspect value.ml
- File "_none_", line 1:
- Alert ocaml_deprecated_cli: Setting a warning with a sequence of lowercase or uppercase letters,
- like 'Aelz', is deprecated.
- Use the equivalent signed form: +A-e-l-z.
- Hint: Enabling or disabling a warning by its mnemonic name requires a + or - prefix.
- ocamlc -c -w Aelz dot.mli
- File "_none_", line 1:
- Alert ocaml_deprecated_cli: Setting a warning with a sequence of lowercase or uppercase letters,
- like 'Aelz', is deprecated.
- Use the equivalent signed form: +A-e-l-z.
- Hint: Enabling or disabling a warning by its mnemonic name requires a + or - prefix.
- ocamlopt -c -w Aelz -for-pack Inspect dot.ml
- File "_none_", line 1:
- Alert ocaml_deprecated_cli: Setting a warning with a sequence of lowercase or uppercase letters,
- like 'Aelz', is deprecated.
- Use the equivalent signed form: +A-e-l-z.
- Hint: Enabling or disabling a warning by its mnemonic name requires a + or - prefix.
- 
- File "dot.ml", line 1:
- Error: "aux.cmx" contains the description for unit
-        "Aux" when "Inspect.Aux" was expected
- make[1]: *** [OCamlMakefile:1054: dot.cmx] Error 2
- make[1]: Leaving directory '/home/opam/.opam/default/.opam-switch/build/inspect.0.2.1'
- make: *** [OCamlMakefile:789: native-code-library] Error 2
[ERROR] The compilation of inspect.0.2.1 failed at "make".
build failed... 

=== STDERR ===

2026-10-06 17:36.36: FAILED: build inspect.0.2.1
2026-10-06 17:36.36: Job failed: build failed: inspect.0.2.1