Build:
  1. 0
2026-10-06 17:36.37: New job: build zenon_modulo.0.5.0 (d03f8c372599)
2026-10-06 17:36.37: Waiting for resource in pool day11-builds
2026-10-06 17:44.54: Got resource from pool day11-builds
2026-10-06 17:44.54: [profile oxcaml-odoc-master] build zenon_modulo.0.5.0
2026-10-06 17:44.54: build zenon_modulo.0.5.0 (d03f8c372599)
=== DEPENDENCIES (9 transitive) ===
  conf-autoconf.1                                    8ee1e3913008
  conf-gmp.5                                         c2adbec9a470
  conf-which.1                                       65c43ca119c3
  ocaml.5.2.0                                        879ae859f814
  ocaml-config.3                                     37112a8040f8
  ocaml-variants.5.2.0+ox                            8119d9341417
  ocamlfind.1.9.8+ox                                 665ae3389aa8
  oxcaml-compiler.5.2.0minus39                       72925b65bf23
  zarith.1.12+ox3                                    917487f93f0e
=== STDOUT ===
Processing: [default: loading data]
[zenon_modulo.0.5.0: dl]
[zenon_modulo.0.5.0: extract]
-> retrieved zenon_modulo.0.5.0  (https://opam.ocaml.org/cache)
[zenon_modulo: ./configure]
+ /home/opam/.opam/default/.opam-switch/build/zenon_modulo.0.5.0/./configure "--prefix" "/home/opam/.opam/default" "--libdir" "/home/opam/.opam/default/lib" (CWD=/home/opam/.opam/default/.opam-switch/build/zenon_modulo.0.5.0)
- echo '(* This file is automatically generated. *)' >config.ml.tmp
- echo 'let libdir = "/home/opam/.opam/default/lib";;' >> config.ml.tmp
- if ! cmp -s config.ml config.ml.tmp; then cp config.ml.tmp config.ml; fi
- rm -f config.ml.tmp
- ocamlyacc -v parsezen.mly
- ocamllex lexzen.mll
- 91 states, 1911 transitions, table size 8190 bytes
- ocamlyacc -v parsetptp.mly
- 4 shift/reduce conflicts, 2 reduce/reduce conflicts.
- ocamllex lextptp.mll
- 97 states, 3613 transitions, table size 15034 bytes
- ocamlyacc -v parsecoq.mly
- ocamllex lexcoq.mll
- 246 states, 11581 transitions, table size 47800 bytes
- 2852 additional bytes used for bindings
- ocamlyacc -v parsedk.mly
- ocamllex lexdk.mll
- 241 states, 9443 transitions, table size 39218 bytes
- 3278 additional bytes used for bindings
- echo '(* This file is automatically generated. *)' >checksum.ml
- echo 'let v = "'`sum log.ml version.ml config.ml misc.ml heap.ml globals.ml error.ml progress.ml namespace.ml expr.ml phrase.ml llproof.ml mlproof.ml index.ml print.ml watch.ml eqrel.ml rewrite.ml typer.ml step.ml node.ml extension.ml mltoll.ml CCVector.ml printBox.ml simplex.ml arith.ml parsezen.ml lexzen.ml parsetptp.ml lextptp.ml typetptp.ml parsecoq.ml lexcoq.ml parsedk.ml lexdk.ml tptp.ml coqterm.ml lltocoq.ml dkterm.ml dkprint.ml lltodk.ml lpprint.ml lltolp.ml enum.ml isar_case.ml lltoisar.ml ext_focal.ml ext_tla.ml ext_recfun.ml ext_equiv.ml ext_induct.ml ext_arith.ml prove.ml checksum.ml versionnum.ml main.ml zenon.ml | sum`'";;' >>checksum.ml
- ocamldep log.ml version.ml config.ml misc.ml heap.ml globals.ml error.ml progress.ml namespace.ml expr.ml phrase.ml llproof.ml mlproof.ml index.ml print.ml watch.ml eqrel.ml rewrite.ml typer.ml step.ml node.ml extension.ml mltoll.ml CCVector.ml printBox.ml simplex.ml arith.ml parsezen.ml lexzen.ml parsetptp.ml lextptp.ml typetptp.ml parsecoq.ml lexcoq.ml parsedk.ml lexdk.ml tptp.ml coqterm.ml lltocoq.ml dkterm.ml dkprint.ml lltodk.ml lpprint.ml lltolp.ml enum.ml isar_case.ml lltoisar.ml ext_focal.ml ext_tla.ml ext_recfun.ml ext_equiv.ml ext_induct.ml ext_arith.ml prove.ml checksum.ml versionnum.ml main.ml zenon.ml log.mli version.mli config.mli misc.mli heap.mli globals.mli error.mli progress.mli namespace.mli expr.mli phrase.mli llproof.mli mlproof.mli index.mli print.mli watch.mli eqrel.mli rewrite.mli typer.mli step.mli node.mli extension.mli mltoll.mli CCVector.mli printBox.mli simplex.mli arith.mli parsezen.mli lexzen.mli parsetptp.mli lextptp.mli typetptp.mli parsecoq.mli lexcoq.mli parsedk.mli lexdk.mli tptp.mli coqterm.mli lltocoq.mli dkterm.mli dkprint.mli lltodk.mli lpprint.mli lltolp.mli enum.mli isar_case.mli lltoisar.mli ext_focal.mli ext_tla.mli ext_recfun.mli ext_equiv.mli ext_induct.mli ext_arith.mli prove.mli checksum.mli versionnum.mli main.mli zenon.mli >.depend
- : zenon.v zenon_coqbool.v zenon_equiv.v zenon_induct.v zenon_focal.v zenon_arith.v zenon_arith_reals.v >>.depend
- Configuration summary for zenon:
- EXE=
- INSTALL_BIN_DIR=/home/opam/.opam/default/bin
- INSTALL_LIB_DIR=/home/opam/.opam/default/lib
- BYT_DEBUG_FLAGS=
- BIN_DEBUG_FLAGS=
- SUM=sum
- CONVERT=:
- GS=:
- CAMLBYT=ocamlc.opt -I /home/opam/.opam/default/lib/zarith
- CAMLBIN=ocamlopt.opt -I /home/opam/.opam/default/lib/zarith
- CAMLLEX=ocamllex
- CAMLYACC=ocamlyacc
- CAMLDEP=ocamldep
- COQC=:
- COQDEP=:
- DKCHECK=:
[zenon_modulo: make]
+ /usr/bin/make  (CWD=/home/opam/.opam/default/.opam-switch/build/zenon_modulo.0.5.0)
- ocamlc.opt -I /home/opam/.opam/default/lib/zarith -I +unix -I +str -warn-error ""  -c log.mli
- ocamlc.opt -I /home/opam/.opam/default/lib/zarith -I +unix -I +str -warn-error ""  -c log.ml
- ocamlc.opt -I /home/opam/.opam/default/lib/zarith -I +unix -I +str -warn-error ""  -c version.mli
- ocamlc.opt -I /home/opam/.opam/default/lib/zarith -I +unix -I +str -warn-error ""  -c version.ml
- ocamlc.opt -I /home/opam/.opam/default/lib/zarith -I +unix -I +str -warn-error ""  -c config.mli
- ocamlc.opt -I /home/opam/.opam/default/lib/zarith -I +unix -I +str -warn-error ""  -c config.ml
- ocamlc.opt -I /home/opam/.opam/default/lib/zarith -I +unix -I +str -warn-error ""  -c misc.mli
- ocamlc.opt -I /home/opam/.opam/default/lib/zarith -I +unix -I +str -warn-error ""  -c misc.ml
- ocamlc.opt -I /home/opam/.opam/default/lib/zarith -I +unix -I +str -warn-error ""  -c heap.mli
- ocamlc.opt -I /home/opam/.opam/default/lib/zarith -I +unix -I +str -warn-error ""  -c heap.ml
- ocamlc.opt -I /home/opam/.opam/default/lib/zarith -I +unix -I +str -warn-error ""  -c globals.mli
- ocamlc.opt -I /home/opam/.opam/default/lib/zarith -I +unix -I +str -warn-error ""  -c globals.ml
- ocamlc.opt -I /home/opam/.opam/default/lib/zarith -I +unix -I +str -warn-error ""  -c error.mli
- ocamlc.opt -I /home/opam/.opam/default/lib/zarith -I +unix -I +str -warn-error ""  -c error.ml
- ocamlc.opt -I /home/opam/.opam/default/lib/zarith -I +unix -I +str -warn-error ""  -c progress.mli
- ocamlc.opt -I /home/opam/.opam/default/lib/zarith -I +unix -I +str -warn-error ""  -c progress.ml
- ocamlc.opt -I /home/opam/.opam/default/lib/zarith -I +unix -I +str -warn-error ""  -c namespace.mli
- ocamlc.opt -I /home/opam/.opam/default/lib/zarith -I +unix -I +str -warn-error ""  -c namespace.ml
- ocamlc.opt -I /home/opam/.opam/default/lib/zarith -I +unix -I +str -warn-error ""  -c expr.mli
- ocamlc.opt -I /home/opam/.opam/default/lib/zarith -I +unix -I +str -warn-error ""  -c expr.ml
- ocamlc.opt -I /home/opam/.opam/default/lib/zarith -I +unix -I +str -warn-error ""  -c phrase.mli
- ocamlc.opt -I /home/opam/.opam/default/lib/zarith -I +unix -I +str -warn-error ""  -c phrase.ml
- ocamlc.opt -I /home/opam/.opam/default/lib/zarith -I +unix -I +str -warn-error ""  -c llproof.mli
- ocamlc.opt -I /home/opam/.opam/default/lib/zarith -I +unix -I +str -warn-error ""  -c llproof.ml
- ocamlc.opt -I /home/opam/.opam/default/lib/zarith -I +unix -I +str -warn-error ""  -c mlproof.mli
- ocamlc.opt -I /home/opam/.opam/default/lib/zarith -I +unix -I +str -warn-error ""  -c mlproof.ml
- ocamlc.opt -I /home/opam/.opam/default/lib/zarith -I +unix -I +str -warn-error ""  -c index.mli
- ocamlc.opt -I /home/opam/.opam/default/lib/zarith -I +unix -I +str -warn-error ""  -c index.ml
- ocamlc.opt -I /home/opam/.opam/default/lib/zarith -I +unix -I +str -warn-error ""  -c print.mli
- ocamlc.opt -I /home/opam/.opam/default/lib/zarith -I +unix -I +str -warn-error ""  -c print.ml
- ocamlc.opt -I /home/opam/.opam/default/lib/zarith -I +unix -I +str -warn-error ""  -c watch.mli
- ocamlc.opt -I /home/opam/.opam/default/lib/zarith -I +unix -I +str -warn-error ""  -c watch.ml
- ocamlc.opt -I /home/opam/.opam/default/lib/zarith -I +unix -I +str -warn-error ""  -c eqrel.mli
- ocamlc.opt -I /home/opam/.opam/default/lib/zarith -I +unix -I +str -warn-error ""  -c eqrel.ml
- ocamlc.opt -I /home/opam/.opam/default/lib/zarith -I +unix -I +str -warn-error ""  -c node.mli
- ocamlc.opt -I /home/opam/.opam/default/lib/zarith -I +unix -I +str -warn-error ""  -c rewrite.mli
- ocamlc.opt -I /home/opam/.opam/default/lib/zarith -I +unix -I +str -warn-error ""  -c rewrite.ml
- ocamlc.opt -I /home/opam/.opam/default/lib/zarith -I +unix -I +str -warn-error ""  -c typer.mli
- ocamlc.opt -I /home/opam/.opam/default/lib/zarith -I +unix -I +str -warn-error ""  -c typer.ml
- ocamlc.opt -I /home/opam/.opam/default/lib/zarith -I +unix -I +str -warn-error ""  -c step.mli
- ocamlc.opt -I /home/opam/.opam/default/lib/zarith -I +unix -I +str -warn-error ""  -c step.ml
- ocamlc.opt -I /home/opam/.opam/default/lib/zarith -I +unix -I +str -warn-error ""  -c node.ml
- ocamlc.opt -I /home/opam/.opam/default/lib/zarith -I +unix -I +str -warn-error ""  -c extension.mli
- ocamlc.opt -I /home/opam/.opam/default/lib/zarith -I +unix -I +str -warn-error ""  -c extension.ml
- ocamlc.opt -I /home/opam/.opam/default/lib/zarith -I +unix -I +str -warn-error ""  -c mltoll.mli
- ocamlc.opt -I /home/opam/.opam/default/lib/zarith -I +unix -I +str -warn-error ""  -c mltoll.ml
- ocamlc.opt -I /home/opam/.opam/default/lib/zarith -I +unix -I +str -warn-error ""  -c CCVector.mli
- ocamlc.opt -I /home/opam/.opam/default/lib/zarith -I +unix -I +str -warn-error ""  -c CCVector.ml
- ocamlc.opt -I /home/opam/.opam/default/lib/zarith -I +unix -I +str -warn-error ""  -c printBox.mli
- ocamlc.opt -I /home/opam/.opam/default/lib/zarith -I +unix -I +str -warn-error ""  -c printBox.ml
- File "printBox.ml", line 1:
- Error: The implementation "printBox.ml"
-        does not match the interface "printBox.cmi": 
-        Values do not match:
-          val set_string_len : (bytes @ immutable -> int) -> unit
-        is not included in
-          val set_string_len : (Bytes.t -> int) -> unit
-        The type "(bytes @ immutable -> int) -> unit"
-        is not compatible with the type "(Bytes.t -> int) -> unit"
-        Type "bytes @ immutable -> int" is not compatible with type
-          "Bytes.t -> int"
-        File "printBox.mli", line 75, characters 0-45: Expected declaration
-        File "printBox.ml", line 41, characters 4-18: Actual declaration
- make: *** [Makefile:124: printBox.cmo] Error 2
[ERROR] The compilation of zenon_modulo.0.5.0 failed at "make".
build failed... 

=== STDERR ===

2026-10-06 17:45.15: FAILED: build zenon_modulo.0.5.0
2026-10-06 17:45.15: Job failed: build failed: zenon_modulo.0.5.0