Build:
- 0
2026-10-06 19:10.45: New job: build guile.1.0 (b6fb01275e4a)
2026-10-06 19:10.45: Waiting for resource in pool day11-builds
2026-10-06 19:13.46: Got resource from pool day11-builds
2026-10-06 19:13.46: [profile oxcaml-odoc-master] build guile.1.0
2026-10-06 19:13.47: build guile.1.0 (b6fb01275e4a)
=== DEPENDENCIES (54 transitive) ===
astring.0.8.5 9560ad717500
base.v0.18~preview.130.106+341 c9ab37324231
base-threads.base 464810371b96
base-unix.base 4596d20d2cf7
base_internalhash_types.v0.18~preview.130.106+341 a64811245ced
basement.v0.18~preview.130.106+341 9841cadec557
camlp-streams.5.0.1 f6f98a47780d
capsule0.v0.18~preview.130.106+341 2b9a1109f3d9
conf-autoconf.1 8ee1e3913008
conf-gmp.5 c2adbec9a470
conf-guile.1 7e40b24cf3a9
conf-libffi.2.0.0 3b04165a8510
conf-pkg-config.5 e39f7209b38f
conf-which.1 65c43ca119c3
csexp.1.5.2 3194ba1b6774
ctypes.0.24.0+ox 927b9c3563e2
ctypes-foreign.0.24.0+ox 793176c548fd
dune.3.22.2+ox 9158bd0e098d
dune-configurator.3.22.2+ox b9a3eeb73695
integers.0.8.0 3b20eae8b330
nonempty_list_type.v0.18~preview.130.106+341 83e124541851
num.1.6 e1118115ba69
ocaml.5.2.0 879ae859f814
ocaml-compiler-libs.v0.17.0+ox 598bb8a6526c
ocaml-config.3 37112a8040f8
ocaml-variants.5.2.0+ox 8119d9341417
ocaml_intrinsics_kernel.v0.18~preview.130.106+341 16c60cbc9f67
ocamlbuild.0.16.1+ox c3cff747c7d3
ocamlfind.1.9.8+ox 665ae3389aa8
odoc-parser.3.2.1+master.1790607351.6dc5826 6f2bb182a512
oxcaml-compiler.5.2.0minus39 72925b65bf23
parsexp.v0.18~preview.130.106+341 b9a6e5d25db3
ppx_array_base.v0.18~preview.130.106+341 9b19bb00658c
ppx_base.v0.18~preview.130.106+341 ea61e36cb513
ppx_compare.v0.18~preview.130.106+341 1ca46f2a02e6
ppx_derivers.1.2.1 ce8a3d704727
ppx_enumerate.v0.18~preview.130.106+341 a25018fdcecb
ppx_globalize.v0.18~preview.130.106+341 0f55b3612142
ppx_hash.v0.18~preview.130.106+341 f0cca56742c7
ppx_helpers.v0.18~preview.130.106+341 f116bca67c51
ppx_js_style.v0.18~preview.130.106+341 b8c427fb3476
ppx_sexp_conv.v0.18~preview.130.106+341 84b0548f9b46
ppx_shorthand.v0.18~preview.130.106+341 109f5125fb3e
ppx_template.v0.18~preview.130.106+341 6358582d0b34
ppxlib.0.33.0+ox2 8c73c0c4d8b8
ppxlib_ast.0.33.0+ox2 5b27258ee8c8
ppxlib_jane.v0.18~preview.130.106+341 80aa18179975
sexp_type.v0.18~preview.130.106+341 d7b92c288522
sexplib.v0.18~preview.130.106+341 618d8bbb7797
sexplib0.v0.18~preview.130.106+341 48e488b6840d
stdio.v0.18~preview.130.106+341 fd7024df0a5e
stdlib-shims.0.3.0 dad692a03c41
topkg.1.1.1+ox 1a471d9bef47
unique.v0.18~preview.130.106+341 f9101821cf39
=== STDOUT ===
Processing: [default: loading data]
[guile.1.0: dl]
[guile.1.0: extract]
-> retrieved guile.1.0 (https://opam.ocaml.org/cache)
[guile: dune build]
+ /home/opam/.opam/default/bin/dune "build" "-p" "guile" "-j" "39" "--promote-install-files=false" "@install" (CWD=/home/opam/.opam/default/.opam-switch/build/guile.1.0)
- File "stubgen/dune", lines 12-16, characters 0-263:
- 12 | (rule (targets bindings_stubs_gen.exe)
- 13 | (deps bindings_stubs_gen.c c_flags c_library_flags)
- 14 | (action
- 15 | (bash
- 16 | "%{cc} bindings_stubs_gen.c -I `dirname %{lib:ctypes:ctypes_cstubs_internals.h}` -I %{ocaml_where} $(< c_flags) $(< c_library_flags) -o %{targets}")))
- (cd _build/default/stubgen && /usr/bin/bash -e -u -o pipefail -c 'gcc -O2 -fno-strict-aliasing -fwrapv -pthread -fPIC -pthread -D_FILE_OFFSET_BITS=64 -Wall -fdiagnostics-color=always bindings_stubs_gen.c -I `dirname /home/opam/.opam/default/lib/ctypes/ctypes_cstubs_internals.h` -I /home/opam/.opam/default/lib/ocaml $(< c_flags) $(< c_library_flags) -o bindings_stubs_gen.exe')
- In file included from /home/opam/.opam/default/lib/ctypes/ctypes_primitives.h:16,
- from /home/opam/.opam/default/lib/ctypes/ctypes_cstubs_internals.h:13,
- from bindings_stubs_gen.c:6:
- /home/opam/.opam/default/lib/ctypes/ocaml_integers.h:37:9: warning: "Int8_val" redefined
- 37 | #define Int8_val(V) ((int8_t)(Int_val(V)))
- | ^~~~~~~~
- In file included from /home/opam/.opam/default/lib/ctypes/ocaml_integers.h:11:
- /home/opam/.opam/default/lib/ocaml/caml/mlvalues.h:154:9: note: this is the location of the previous definition
- 154 | #define Int8_val(x) ((int8_t) Long_val(x))
- | ^~~~~~~~
- /home/opam/.opam/default/lib/ctypes/ocaml_integers.h:38:9: warning: "Int16_val" redefined
- 38 | #define Int16_val(V) ((int16_t)(Int_val(V)))
- | ^~~~~~~~~
- /home/opam/.opam/default/lib/ocaml/caml/mlvalues.h:153:9: note: this is the location of the previous definition
- 153 | #define Int16_val(x) ((int16_t) Long_val(x))
- | ^~~~~~~~~
- bindings_stubs_gen.c: In function 'main':
- bindings_stubs_gen.c:35:41: warning: cast from pointer to integer of different size [-Wpointer-to-int-cast]
- 35 | enum { check_SCM_UNDEFINED_const = (int)SCM_UNDEFINED };
- | ^
- bindings_stubs_gen.c:36:19: error: initialization of 'intptr_t' {aka 'long int'} from 'struct scm_unused_struct *' makes integer from pointer without a cast [-Wint-conversion]
- 36 | intptr_t v = (SCM_UNDEFINED);
- | ^
- bindings_stubs_gen.c:42:35: warning: cast from pointer to integer of different size [-Wpointer-to-int-cast]
- 42 | enum { check_SCM_EOL_const = (int)SCM_EOL };
- | ^
- bindings_stubs_gen.c:43:19: error: initialization of 'intptr_t' {aka 'long int'} from 'struct scm_unused_struct *' makes integer from pointer without a cast [-Wint-conversion]
- 43 | intptr_t v = (SCM_EOL);
- | ^
- bindings_stubs_gen.c:49:38: warning: cast from pointer to integer of different size [-Wpointer-to-int-cast]
- 49 | enum { check_SCM_BOOL_T_const = (int)SCM_BOOL_T };
- | ^
- bindings_stubs_gen.c:50:19: error: initialization of 'intptr_t' {aka 'long int'} from 'struct scm_unused_struct *' makes integer from pointer without a cast [-Wint-conversion]
- 50 | intptr_t v = (SCM_BOOL_T);
- | ^
- bindings_stubs_gen.c:56:38: warning: cast from pointer to integer of different size [-Wpointer-to-int-cast]
- 56 | enum { check_SCM_BOOL_F_const = (int)SCM_BOOL_F };
- | ^
- bindings_stubs_gen.c:57:19: error: initialization of 'intptr_t' {aka 'long int'} from 'struct scm_unused_struct *' makes integer from pointer without a cast [-Wint-conversion]
- 57 | intptr_t v = (SCM_BOOL_F);
- | ^
[ERROR] The compilation of guile.1.0 failed at "dune build -p guile -j 39 --promote-install-files=false @install".
build failed...
=== STDERR ===
2026-10-06 19:14.23: FAILED: build guile.1.0
2026-10-06 19:14.23: Job failed: build failed: guile.1.0