Build:
- 0
2026-10-06 21:18.47: New job: build randoml.0.1.5 (1f326a8dc716)
2026-10-06 21:18.47: Waiting for resource in pool day11-builds
2026-10-06 21:20.50: Got resource from pool day11-builds
2026-10-06 21:20.50: [profile oxcaml-odoc-master] build randoml.0.1.5
2026-10-06 21:20.50: build randoml.0.1.5 (1f326a8dc716)
=== DEPENDENCIES (105 transitive) ===
astring.0.8.5 9560ad717500
base.v0.18~preview.130.106+341 c9ab37324231
base-threads.base 464810371b96
base-unix.base 4596d20d2cf7
base_bigstring.v0.18~preview.130.106+341 e0107300ed6d
base_internalhash_types.v0.18~preview.130.106+341 a64811245ced
base_quickcheck.v0.18~preview.130.106+341 3221c7ad9d0b
basement.v0.18~preview.130.106+341 9841cadec557
bignum.v0.18~preview.130.106+341 1a2d9986251f
bin_prot.v0.18~preview.130.106+341 6cfd5562dd52
camlp-streams.5.0.1 f6f98a47780d
capitalization.v0.18~preview.130.106+341 0bf07e2f44ed
capsule.v0.18~preview.130.106+341 0d354aac6887
capsule0.v0.18~preview.130.106+341 2b9a1109f3d9
conf-autoconf.1 8ee1e3913008
conf-gmp.5 c2adbec9a470
conf-rust-2018.1 9a73a673d8e6
conf-which.1 65c43ca119c3
core.v0.18~preview.130.106+341 a710ee0566d9
core_kernel.v0.18~preview.130.106+341 61fe6c126620
csexp.1.5.2 3194ba1b6774
dune.3.22.2+ox 9158bd0e098d
dune-configurator.3.22.2+ox b9a3eeb73695
fieldslib.v0.18~preview.130.106+341 aa7ede13a6a1
int_repr.v0.18~preview.130.106+341 f0d513183a74
jane-street-headers.v0.18~preview.130.106+341 3f558bff02af
jst-config.v0.18~preview.130.106+341 4ce982c12834
nonempty_list_type.v0.18~preview.130.106+341 83e124541851
num.1.6 e1118115ba69
ocaml.5.2.0 879ae859f814
ocaml-compiler-libs.v0.17.0+ox 598bb8a6526c
ocaml-config.3 37112a8040f8
ocaml-variants.5.2.0+ox 8119d9341417
ocaml_intrinsics_kernel.v0.18~preview.130.106+341 16c60cbc9f67
ocamlbuild.0.16.1+ox c3cff747c7d3
ocamlfind.1.9.8+ox 665ae3389aa8
odoc-parser.3.2.1+master.1790607351.6dc5826 6f2bb182a512
oxcaml-compiler.5.2.0minus39 72925b65bf23
parsexp.v0.18~preview.130.106+341 b9a6e5d25db3
portable.v0.18~preview.130.106+341 e00370adabe5
ppx_array_base.v0.18~preview.130.106+341 9b19bb00658c
ppx_assert.v0.18~preview.130.106+341 554617dea969
ppx_base.v0.18~preview.130.106+341 ea61e36cb513
ppx_bench.v0.18~preview.130.106+341 6d5b5989e5a4
ppx_bin_prot.v0.18~preview.130.106+341 d1afe20ba013
ppx_compare.v0.18~preview.130.106+341 1ca46f2a02e6
ppx_custom_printf.v0.18~preview.130.106+341 111aed9c6c26
ppx_debug_assert.v0.18~preview.130.106+341 128c0a70c5d5
ppx_derivers.1.2.1 ce8a3d704727
ppx_diff.v0.18~preview.130.106+341 d1f0ba6f14c7
ppx_disable_unused_warnings.v0.18~preview.130.106+341 fc28c6aae10f
ppx_enumerate.v0.18~preview.130.106+341 a25018fdcecb
ppx_expect.v0.18~preview.130.106+341 c866a64a4d8f
ppx_fields_conv.v0.18~preview.130.106+341 0819ce98d1d8
ppx_fixed_literal.v0.18~preview.130.106+341 1aa44b937736
ppx_fuelproof.v0.18~preview.130.106+341 85e552f37147
ppx_globalize.v0.18~preview.130.106+341 0f55b3612142
ppx_hash.v0.18~preview.130.106+341 f0cca56742c7
ppx_helpers.v0.18~preview.130.106+341 f116bca67c51
ppx_here.v0.18~preview.130.106+341 890ef9467d39
ppx_ignore_instrumentation.v0.18~preview.130.106+341 02feef919fa8
ppx_inline_test.v0.18~preview.130.106+341 ac733e73b6e3
ppx_int63_literal.v0.18~preview.130.106+341 f984168c0e7f
ppx_jane.v0.18~preview.130.106+341 305604d907d2
ppx_js_style.v0.18~preview.130.106+341 b8c427fb3476
ppx_let.v0.18~preview.130.106+341 005485010528
ppx_log.v0.18~preview.130.106+341 e185d83693d3
ppx_module_timer.v0.18~preview.130.106+341 28692b4ff38f
ppx_optcomp.v0.18~preview.130.106+341 172265c99f24
ppx_optional.v0.18~preview.130.106+341 bd2da2e10159
ppx_pipebang.v0.18~preview.130.106+341 8b92cef16533
ppx_portable.v0.18~preview.130.106+341 17f1704620f2
ppx_sexp_conv.v0.18~preview.130.106+341 84b0548f9b46
ppx_sexp_message.v0.18~preview.130.106+341 6bf0d698ab6c
ppx_sexp_value.v0.18~preview.130.106+341 90d8bfa6ee9c
ppx_shorthand.v0.18~preview.130.106+341 109f5125fb3e
ppx_stable.v0.18~preview.130.106+341 6a25c6604872
ppx_stable_witness.v0.18~preview.130.106+341 5724712bd223
ppx_string.v0.18~preview.130.106+341 48eb5ca992bb
ppx_string_conv.v0.18~preview.130.106+341 7c4821783c32
ppx_template.v0.18~preview.130.106+341 6358582d0b34
ppx_tydi.v0.18~preview.130.106+341 bb273f6be6f6
ppx_typed_fields.v0.18~preview.130.106+341 96ff02e03ccf
ppx_typerep_conv.v0.18~preview.130.106+341 67a495ff9c5d
ppx_var_name.v0.18~preview.130.106+341 e419d613eea0
ppx_variants_conv.v0.18~preview.130.106+341 b45fb4659dd1
ppxlib.0.33.0+ox2 8c73c0c4d8b8
ppxlib_ast.0.33.0+ox2 5b27258ee8c8
ppxlib_jane.v0.18~preview.130.106+341 80aa18179975
sexp_type.v0.18~preview.130.106+341 d7b92c288522
sexplib.v0.18~preview.130.106+341 618d8bbb7797
sexplib0.v0.18~preview.130.106+341 48e488b6840d
splittable_random.v0.18~preview.130.106+341 83e8466ac369
stdio.v0.18~preview.130.106+341 fd7024df0a5e
stdlib-shims.0.3.0 dad692a03c41
string_dict.v0.18~preview.130.106+341 778d56e22461
time_now.v0.18~preview.130.106+341 ed278d014da9
topkg.1.1.1+ox 1a471d9bef47
typerep.v0.18~preview.130.106+341 cae57707b8c6
unique.v0.18~preview.130.106+341 f9101821cf39
univ_map.v0.18~preview.130.106+341 0f8c7352c6fa
uopt.v0.18~preview.130.106+341 4ed942597771
variantslib.v0.18~preview.130.106+341 fd78eb53d4a3
zarith.1.12+ox3 917487f93f0e
zarith_stubs_js.v0.18~preview.130.106+341 1e36b28b4933
=== STDOUT ===
Processing: [default: loading data]
[randoml.0.1.5: dl]
[randoml.0.1.5: extract]
-> retrieved randoml.0.1.5 (https://opam.ocaml.org/cache)
[randoml: dune build]
+ /home/opam/.opam/default/bin/dune "build" "-p" "randoml" "-j" "39" "@install" (CWD=/home/opam/.opam/default/.opam-switch/build/randoml.0.1.5)
- (cd _build/default && /home/opam/.opam/default/bin/ocamlc.opt -w -40 -g -bin-annot -bin-annot-occurrences -bin-annot-cms -I lib/.randoml.objs/byte -I /home/opam/.opam/default/lib/base -I /home/opam/.opam/default/lib/base/md5 -I /home/opam/.opam/default/lib/base/shadow_stdlib -I /home/opam/.opam/default/lib/base_bigstring -I /home/opam/.opam/default/lib/base_internalhash_types -I /home/opam/.opam/default/lib/base_quickcheck -I /home/opam/.opam/default/lib/base_quickcheck/ppx_quickcheck/runtime -I /home/opam/.opam/default/lib/basement -I /home/opam/.opam/default/lib/bignum/bigint -I /home/opam/.opam/default/lib/bin_prot -I /home/opam/.opam/default/lib/bin_prot/shape -I /home/opam/.opam/default/lib/capsule -I /home/opam/.opam/default/lib/capsule0/blocking_sync -I /home/opam/.opam/default/lib/capsule0/prim -I /home/opam/.opam/default/lib/core -I /home/opam/.opam/default/lib/core/base_for_tests -I /home/opam/.opam/default/lib/core/command -I /home/opam/.opam/default/lib/core/filename_base -I /home/opam/.opam/default/lib/core/heap_block -I /home/opam/.opam/default/lib/core/validate -I /home/opam/.opam/default/lib/core_kernel -I /home/opam/.opam/default/lib/fieldslib -I /home/opam/.opam/default/lib/int_repr -I /home/opam/.opam/default/lib/jane-street-headers -I /home/opam/.opam/default/lib/nonempty_list_type -I /home/opam/.opam/default/lib/num -I /home/opam/.opam/default/lib/ocaml_intrinsics_kernel -I /home/opam/.opam/default/lib/parsexp -I /home/opam/.opam/default/lib/portable -I /home/opam/.opam/default/lib/portable/common -I /home/opam/.opam/default/lib/portable/kernel -I /home/opam/.opam/default/lib/ppx_assert/runtime-lib -I /home/opam/.opam/default/lib/ppx_bench/config -I /home/opam/.opam/default/lib/ppx_bench/config_types -I /home/opam/.opam/default/lib/ppx_bench/runtime-lib -I /home/opam/.opam/default/lib/ppx_compare/runtime-lib -I /home/opam/.opam/default/lib/ppx_diff/diffable -I /home/opam/.opam/default/lib/ppx_diff/diffable_cinaps -I /home/opam/.opam/default/lib/ppx_enumerate/runtime-lib -I /home/opam/.opam/default/lib/ppx_expect/config -I /home/opam/.opam/default/lib/ppx_expect/config_types -I /home/opam/.opam/default/lib/ppx_expect/make_corrected_file -I /home/opam/.opam/default/lib/ppx_expect/make_corrected_file_kernel -I /home/opam/.opam/default/lib/ppx_expect/runtime -I /home/opam/.opam/default/lib/ppx_expect/runtime_types -I /home/opam/.opam/default/lib/ppx_fuelproof/runtime -I /home/opam/.opam/default/lib/ppx_hash/runtime-lib -I /home/opam/.opam/default/lib/ppx_here/runtime-lib -I /home/opam/.opam/default/lib/ppx_inline_test/config -I /home/opam/.opam/default/lib/ppx_inline_test/runtime-lib -I /home/opam/.opam/default/lib/ppx_log/syntax -I /home/opam/.opam/default/lib/ppx_log/types -I /home/opam/.opam/default/lib/ppx_module_timer/runtime -I /home/opam/.opam/default/lib/ppx_portable/runtime -I /home/opam/.opam/default/lib/ppx_sexp_conv/runtime-lib -I /home/opam/.opam/default/lib/ppx_stable_witness/runtime -I /home/opam/.opam/default/lib/ppx_stable_witness/stable_witness -I /home/opam/.opam/default/lib/ppx_string/runtime -I /home/opam/.opam/default/lib/ppx_string_conv/runtime -I /home/opam/.opam/default/lib/ppx_typed_fields/typed_fields_lib -I /home/opam/.opam/default/lib/ppx_typed_fields/typed_variants_lib -I /home/opam/.opam/default/lib/ppxlib/print_diff -I /home/opam/.opam/default/lib/ppxlib/stdppx -I /home/opam/.opam/default/lib/ppxlib_ast/stdppx -I /home/opam/.opam/default/lib/sexp_type -I /home/opam/.opam/default/lib/sexp_type/grammar -I /home/opam/.opam/default/lib/sexplib -I /home/opam/.opam/default/lib/sexplib0 -I /home/opam/.opam/default/lib/splittable_random -I /home/opam/.opam/default/lib/stdio -I /home/opam/.opam/default/lib/stdlib-shims -I /home/opam/.opam/default/lib/string_dict -I /home/opam/.opam/default/lib/time_now -I /home/opam/.opam/default/lib/typerep -I /home/opam/.opam/default/lib/unique -I /home/opam/.opam/default/lib/univ_map -I /home/opam/.opam/default/lib/variantslib -I /home/opam/.opam/default/lib/zarith -I /home/opam/.opam/default/lib/zarith_stubs_js -I lib/rand/.rand.objs/byte -cmi-file lib/.randoml.objs/byte/randoml.cmi -no-alias-deps -o lib/.randoml.objs/byte/randoml.cmo -c -impl lib/randoml.pp.ml)
- File "lib/randoml.ml", line 1, characters 5-16:
- 1 | open Core_kernel
- ^^^^^^^^^^^
- Alert deprecated: module Core_kernel
- [since 2021-05] Use [Core] -- [Core_kernel] was renamed as [Core]
- (cd _build/default && /home/opam/.opam/default/bin/ocamlopt.opt -w -40 -g -I lib/.randoml.objs/byte -I lib/.randoml.objs/native -I /home/opam/.opam/default/lib/base -I /home/opam/.opam/default/lib/base/md5 -I /home/opam/.opam/default/lib/base/shadow_stdlib -I /home/opam/.opam/default/lib/base_bigstring -I /home/opam/.opam/default/lib/base_internalhash_types -I /home/opam/.opam/default/lib/base_quickcheck -I /home/opam/.opam/default/lib/base_quickcheck/ppx_quickcheck/runtime -I /home/opam/.opam/default/lib/basement -I /home/opam/.opam/default/lib/bignum/bigint -I /home/opam/.opam/default/lib/bin_prot -I /home/opam/.opam/default/lib/bin_prot/shape -I /home/opam/.opam/default/lib/capsule -I /home/opam/.opam/default/lib/capsule0/blocking_sync -I /home/opam/.opam/default/lib/capsule0/prim -I /home/opam/.opam/default/lib/core -I /home/opam/.opam/default/lib/core/base_for_tests -I /home/opam/.opam/default/lib/core/command -I /home/opam/.opam/default/lib/core/filename_base -I /home/opam/.opam/default/lib/core/heap_block -I /home/opam/.opam/default/lib/core/validate -I /home/opam/.opam/default/lib/core_kernel -I /home/opam/.opam/default/lib/fieldslib -I /home/opam/.opam/default/lib/int_repr -I /home/opam/.opam/default/lib/jane-street-headers -I /home/opam/.opam/default/lib/nonempty_list_type -I /home/opam/.opam/default/lib/num -I /home/opam/.opam/default/lib/ocaml_intrinsics_kernel -I /home/opam/.opam/default/lib/parsexp -I /home/opam/.opam/default/lib/portable -I /home/opam/.opam/default/lib/portable/common -I /home/opam/.opam/default/lib/portable/kernel -I /home/opam/.opam/default/lib/ppx_assert/runtime-lib -I /home/opam/.opam/default/lib/ppx_bench/config -I /home/opam/.opam/default/lib/ppx_bench/config_types -I /home/opam/.opam/default/lib/ppx_bench/runtime-lib -I /home/opam/.opam/default/lib/ppx_compare/runtime-lib -I /home/opam/.opam/default/lib/ppx_diff/diffable -I /home/opam/.opam/default/lib/ppx_diff/diffable_cinaps -I /home/opam/.opam/default/lib/ppx_enumerate/runtime-lib -I /home/opam/.opam/default/lib/ppx_expect/config -I /home/opam/.opam/default/lib/ppx_expect/config_types -I /home/opam/.opam/default/lib/ppx_expect/make_corrected_file -I /home/opam/.opam/default/lib/ppx_expect/make_corrected_file_kernel -I /home/opam/.opam/default/lib/ppx_expect/runtime -I /home/opam/.opam/default/lib/ppx_expect/runtime_types -I /home/opam/.opam/default/lib/ppx_fuelproof/runtime -I /home/opam/.opam/default/lib/ppx_hash/runtime-lib -I /home/opam/.opam/default/lib/ppx_here/runtime-lib -I /home/opam/.opam/default/lib/ppx_inline_test/config -I /home/opam/.opam/default/lib/ppx_inline_test/runtime-lib -I /home/opam/.opam/default/lib/ppx_log/syntax -I /home/opam/.opam/default/lib/ppx_log/types -I /home/opam/.opam/default/lib/ppx_module_timer/runtime -I /home/opam/.opam/default/lib/ppx_portable/runtime -I /home/opam/.opam/default/lib/ppx_sexp_conv/runtime-lib -I /home/opam/.opam/default/lib/ppx_stable_witness/runtime -I /home/opam/.opam/default/lib/ppx_stable_witness/stable_witness -I /home/opam/.opam/default/lib/ppx_string/runtime -I /home/opam/.opam/default/lib/ppx_string_conv/runtime -I /home/opam/.opam/default/lib/ppx_typed_fields/typed_fields_lib -I /home/opam/.opam/default/lib/ppx_typed_fields/typed_variants_lib -I /home/opam/.opam/default/lib/ppxlib/print_diff -I /home/opam/.opam/default/lib/ppxlib/stdppx -I /home/opam/.opam/default/lib/ppxlib_ast/stdppx -I /home/opam/.opam/default/lib/sexp_type -I /home/opam/.opam/default/lib/sexp_type/grammar -I /home/opam/.opam/default/lib/sexplib -I /home/opam/.opam/default/lib/sexplib0 -I /home/opam/.opam/default/lib/splittable_random -I /home/opam/.opam/default/lib/stdio -I /home/opam/.opam/default/lib/stdlib-shims -I /home/opam/.opam/default/lib/string_dict -I /home/opam/.opam/default/lib/time_now -I /home/opam/.opam/default/lib/typerep -I /home/opam/.opam/default/lib/unique -I /home/opam/.opam/default/lib/univ_map -I /home/opam/.opam/default/lib/variantslib -I /home/opam/.opam/default/lib/zarith -I /home/opam/.opam/default/lib/zarith_stubs_js -I lib/rand/.rand.objs/byte -I lib/rand/.rand.objs/native -cmi-file lib/.randoml.objs/byte/randoml.cmi -no-alias-deps -o lib/.randoml.objs/native/randoml.cmx -c -impl lib/randoml.pp.ml)
- File "lib/randoml.ml", line 1, characters 5-16:
- 1 | open Core_kernel
- ^^^^^^^^^^^
- Alert deprecated: module Core_kernel
- [since 2021-05] Use [Core] -- [Core_kernel] was renamed as [Core]
- File "lib/rand/dune", lines 7-26, characters 0-671:
- 7 | (rule
- 8 | (targets librand.a dllrand.so)
- 9 | (deps
- ....
- 24 | -c
- 25 | "mv target/release/librand.so ./dllrand.so 2> /dev/null || mv target/release/librand.dylib ./dllrand.so 2> /dev/null || touch dllrand.so")
- 26 | (run cp target/release/librand.a .))))
- (cd _build/default/lib/rand && /usr/bin/cargo build --release --offline)
- Compiling proc-macro2 v1.0.27
- Compiling unicode-xid v0.2.2
- Compiling libc v0.2.97
- Compiling syn v1.0.73
- Compiling cc v1.0.68
- Compiling ocaml-sys v0.20.1
- Compiling cfg-if v1.0.0
- Compiling cty v0.2.1
- Compiling ocaml-sys v0.22.0
- Compiling quote v1.0.9
- Compiling static_assertions v1.1.0
- Compiling chlorine v1.0.7
- Compiling ppv-lite86 v0.2.10
- Compiling ocaml-boxroot-sys v0.2.0
- Compiling getrandom v0.2.3
- warning: ocaml-boxroot-sys@0.2.0: vendor/boxroot/boxroot.c:23:10: fatal error: caml/compact.h: No such file or directory
- warning: ocaml-boxroot-sys@0.2.0: 23 | #include <caml/compact.h>
- warning: ocaml-boxroot-sys@0.2.0: | ^~~~~~~~~~~~~~~~
- warning: ocaml-boxroot-sys@0.2.0: compilation terminated.
- error: failed to run custom build command for `ocaml-boxroot-sys v0.2.0`
-
- Caused by:
- process didn't exit successfully: `/home/opam/.opam/default/.opam-switch/build/randoml.0.1.5/_build/default/lib/rand/target/release/build/ocaml-boxroot-sys-6f7441702399e165/build-script-build` (exit status: 1)
- --- stdout
- cargo:rerun-if-changed=vendor/boxroot/boxroot.c
- cargo:rerun-if-changed=vendor/boxroot/boxroot.h
- cargo:rerun-if-env-changed=OCAMLOPT
- cargo:rerun-if-env-changed=OCAML_WHERE_PATH
- TARGET = Some("x86_64-unknown-linux-gnu")
- OPT_LEVEL = Some("3")
- HOST = Some("x86_64-unknown-linux-gnu")
- CC_x86_64-unknown-linux-gnu = None
- CC_x86_64_unknown_linux_gnu = None
- HOST_CC = None
- CC = None
- CFLAGS_x86_64-unknown-linux-gnu = None
- CFLAGS_x86_64_unknown_linux_gnu = None
- HOST_CFLAGS = None
- CFLAGS = None
- CRATE_CC_NO_DEFAULTS = None
- DEBUG = Some("false")
- CARGO_CFG_TARGET_FEATURE = Some("fxsr,sse,sse2")
- running: "cc" "-O3" "-ffunction-sections" "-fdata-sections" "-fPIC" "-m64" "-I" "/home/opam/.opam/default/lib/ocaml" "-I" "vendor/boxroot/" "-Wall" "-Wextra" "-o" "/home/opam/.opam/default/.opam-switch/build/randoml.0.1.5/_build/default/lib/rand/target/release/build/ocaml-boxroot-sys-27e7b736356b61c0/out/vendor/boxroot/boxroot.o" "-c" "vendor/boxroot/boxroot.c"
- cargo:warning=vendor/boxroot/boxroot.c:23:10: fatal error: caml/compact.h: No such file or directory
- cargo:warning= 23 | #include <caml/compact.h>
- cargo:warning= | ^~~~~~~~~~~~~~~~
- cargo:warning=compilation terminated.
- exit status: 1
-
- --- stderr
-
-
- error occurred: Command "cc" "-O3" "-ffunction-sections" "-fdata-sections" "-fPIC" "-m64" "-I" "/home/opam/.opam/default/lib/ocaml" "-I" "vendor/boxroot/" "-Wall" "-Wextra" "-o" "/home/opam/.opam/default/.opam-switch/build/randoml.0.1.5/_build/default/lib/rand/target/release/build/ocaml-boxroot-sys-27e7b736356b61c0/out/vendor/boxroot/boxroot.o" "-c" "vendor/boxroot/boxroot.c" with args "cc" did not execute successfully (status code exit status: 1).
-
-
- warning: build failed, waiting for other jobs to finish...
[ERROR] The compilation of randoml.0.1.5 failed at "dune build -p randoml -j 39 @install".
build failed...
=== STDERR ===
2026-10-06 21:21.25: FAILED: build randoml.0.1.5
2026-10-06 21:21.25: Job failed: build failed: randoml.0.1.5