Build:
  1. 0
2026-10-07 21:16.25: New job: build conf-cuda.1 (4b943521cf7d)
2026-10-07 21:16.25: Waiting for resource in pool day11-builds
2026-10-07 21:18.14: Got resource from pool day11-builds
2026-10-07 21:18.14: [profile oxcaml-odoc-master] build conf-cuda.1
2026-10-07 21:18.14: build conf-cuda.1 (4b943521cf7d)
=== DEPENDENCIES (7 transitive) ===
  conf-autoconf.1                                    8ee1e3913008
  conf-cuda-config.1                                 98c7b303cbc5
  conf-which.1                                       65c43ca119c3
  ocaml.5.2.0                                        b8c350f4f1ad
  ocaml-config.3                                     2c72b422dfc3
  ocaml-variants.5.2.0+ox                            60cb73ac7801
  oxcaml-compiler.5.2.0minus39                       c47b62237187
=== STDOUT ===
Processing: [default: loading data]
[conf-cuda: sh cat <<EOF > test.c
   #include  "cuda.h"
   #include  "nvrtc.h"
   ]
+ /usr/bin/sh "-exc" "cat <<EOF > test.c\n   #include  \"cuda.h\"\n   #include  \"nvrtc.h\"\n   " (CWD=/home/opam/.opam/default/.opam-switch/build/conf-cuda.1)
- + cat
[conf-cuda: sh]
+ /usr/bin/sh "-exc" "$(ocamlc -config-var c_compiler) -c $CFLAGS -I'/usr/local/cuda/include' test.c" (CWD=/home/opam/.opam/default/.opam-switch/build/conf-cuda.1)
- + ocamlc -config-var c_compiler
- + gcc -c -I/usr/local/cuda/include test.c
- test.c:1:14: fatal error: cuda.h: No such file or directory
-     1 |    #include  "cuda.h"
-       |              ^~~~~~~~
- compilation terminated.
[ERROR] The compilation of conf-cuda.1 failed at "sh -exc $(ocamlc -config-var c_compiler) -c $CFLAGS -I'/usr/local/cuda/include' test.c".
build failed... 

=== STDERR ===

2026-10-07 21:18.23: FAILED: build conf-cuda.1
2026-10-07 21:18.23: Job failed: build failed: conf-cuda.1