Build:
  1. 0
2026-10-07 21:18.20: New job: build tophide.1.0.4 (5d937fa26fcd)
2026-10-07 21:18.20: Waiting for resource in pool day11-builds
2026-10-07 21:19.49: Got resource from pool day11-builds
2026-10-07 21:19.49: [profile oxcaml-odoc-master] build tophide.1.0.4
2026-10-07 21:19.49: build tophide.1.0.4 (5d937fa26fcd)
=== DEPENDENCIES (7 transitive) ===
  conf-autoconf.1                                    8ee1e3913008
  conf-which.1                                       65c43ca119c3
  ocaml.5.2.0                                        b8c350f4f1ad
  ocaml-config.3                                     2c72b422dfc3
  ocaml-variants.5.2.0+ox                            60cb73ac7801
  ocamlfind.1.9.8+ox                                 70bd5761d4de
  oxcaml-compiler.5.2.0minus39                       c47b62237187
=== STDOUT ===
Processing: [default: loading data]
[tophide.1.0.4: dl]
[tophide.1.0.4: extract]
-> retrieved tophide.1.0.4  (https://opam.ocaml.org/cache)
[tophide: make]
+ /usr/bin/make  (CWD=/home/opam/.opam/default/.opam-switch/build/tophide.1.0.4)
- cat META.in > META
- echo 'version = "1.0.4"' >> META
- ocamlc -I +compiler-libs -c tophide.ml
- File "tophide.ml", line 29, characters 25-46:
- 29 |   print_out_class_type = !print_out_class_type;
-                               ^^^^^^^^^^^^^^^^^^^^^
- Error: This expression has type
-          "Outcometree.out_class_type Format_doc.printer" =
-            "Format_doc.formatter -> Outcometree.out_class_type -> unit"
-        but an expression was expected of type
-          "Format.formatter -> Outcometree.out_class_type -> unit"
-        Type "Format_doc.formatter" is not compatible with type "Format.formatter"
- make: *** [Makefile:11: tophide.cmo] Error 2
build failed... 
[ERROR] The compilation of tophide.1.0.4 failed at "make".

=== STDERR ===

2026-10-07 21:19.58: FAILED: build tophide.1.0.4
2026-10-07 21:19.58: Job failed: build failed: tophide.1.0.4