Build:
- 0
2026-10-07 21:18.20: New job: build termbox.0.1.0 (424f59c66261) 2026-10-07 21:18.20: Waiting for resource in pool day11-builds 2026-10-07 21:19.44: Got resource from pool day11-builds 2026-10-07 21:19.44: [profile oxcaml-odoc-master] build termbox.0.1.0 2026-10-07 21:19.44: build termbox.0.1.0 (424f59c66261) === DEPENDENCIES (7 transitive) === conf-autoconf.1 8ee1e3913008 conf-which.1 65c43ca119c3 ocaml.5.2.0 b8c350f4f1ad ocaml-config.3 2c72b422dfc3 ocaml-variants.5.2.0+ox 60cb73ac7801 ocamlfind.1.9.8+ox 70bd5761d4de oxcaml-compiler.5.2.0minus39 c47b62237187 === STDOUT === Processing: [default: loading data] [WARNING] These additional system packages are required, but not available on your system: python [termbox.0.1.0: dl] [termbox.0.1.0: extract] -> retrieved termbox.0.1.0 (https://opam.ocaml.org/cache) [termbox: make] + /usr/bin/make (CWD=/home/opam/.opam/default/.opam-switch/build/termbox.0.1.0) - cd termbox && ./waf configure && ./waf - env: 'python': No such file or directory - make: *** [Makefile:26: termbox/build/src/libtermbox.a] Error 127 [ERROR] The compilation of termbox.0.1.0 failed at "make". build failed... === STDERR === 2026-10-07 21:19.53: FAILED: build termbox.0.1.0 2026-10-07 21:19.53: Job failed: build failed: termbox.0.1.0