Build:
  1. 0
2026-10-07 21:32.08: New job: build multicont.1.0.3 (39d284c19ccb)
2026-10-07 21:32.08: Waiting for resource in pool day11-builds
2026-10-07 21:38.13: Got resource from pool day11-builds
2026-10-07 21:38.13: [profile oxcaml-odoc-master] build multicont.1.0.3
2026-10-07 21:38.13: build multicont.1.0.3 (39d284c19ccb)
=== DEPENDENCIES (11 transitive) ===
  base-threads.base                                  464810371b96
  base-unix.base                                     4596d20d2cf7
  conf-autoconf.1                                    8ee1e3913008
  conf-which.1                                       65c43ca119c3
  csexp.1.5.2                                        4dac08a488e7
  dune.3.22.2+ox                                     a601158acc62
  dune-configurator.3.22.2+ox                        cc2e07190f84
  ocaml.5.2.0                                        b8c350f4f1ad
  ocaml-config.3                                     2c72b422dfc3
  ocaml-variants.5.2.0+ox                            60cb73ac7801
  oxcaml-compiler.5.2.0minus39                       c47b62237187
=== STDOUT ===
Processing: [default: loading data]
[multicont.1.0.3: dl]
[multicont.1.0.3: extract]
-> retrieved multicont.1.0.3  (https://opam.ocaml.org/cache)
[multicont: dune build]
+ /home/opam/.opam/default/bin/dune "build" "-p" "multicont" "-j" "39" "@install" (CWD=/home/opam/.opam/default/.opam-switch/build/multicont.1.0.3)
[ERROR] The compilation of multicont.1.0.3 failed at "dune build -p multicont -j 39 @install".
- File "lib/dune", line 9, characters 9-24:
- 9 |   (names multicont_stubs))
-              ^^^^^^^^^^^^^^^
- (cd _build/default/lib && /usr/bin/gcc -O2 -fno-strict-aliasing -fwrapv -pthread -fPIC -pthread -D_FILE_OFFSET_BITS=64 -Wall -fdiagnostics-color=always -g -I /home/opam/.opam/default/lib/ocaml -o multicont_stubs_byte.o -c multicont_stubs.c)
- multicont_stubs.c: In function 'multicont_clone_continuation':
- multicont_stubs.c:107:15: error: too few arguments to function 'caml_alloc_stack_noexc'
-   107 |       clone = caml_alloc_stack_noexc(Stack_high(current) - Stack_base(current),
-       |               ^~~~~~~~~~~~~~~~~~~~~~
- In file included from multicont_stubs.c:6:
- /home/opam/.opam/default/lib/ocaml/caml/fiber.h:312:20: note: declared here
-   312 | struct stack_info* caml_alloc_stack_noexc(mlsize_t wosize, value hval,
-       |                    ^~~~~~~~~~~~~~~~~~~~~~
- File "lib/dune", line 14, characters 9-24:
- 14 |   (names multicont_stubs)))
-               ^^^^^^^^^^^^^^^
- (cd _build/default/lib && /usr/bin/gcc -O2 -fno-strict-aliasing -fwrapv -pthread -fPIC -pthread -D_FILE_OFFSET_BITS=64 -Wall -fdiagnostics-color=always -DNATIVE_CODE -g -I /home/opam/.opam/default/lib/ocaml -o multicont_stubs_native.o -c multicont_stubs.c)
- multicont_stubs.c: In function 'multicont_clone_continuation':
- multicont_stubs.c:107:15: error: too few arguments to function 'caml_alloc_stack_noexc'
-   107 |       clone = caml_alloc_stack_noexc(Stack_high(current) - Stack_base(current),
-       |               ^~~~~~~~~~~~~~~~~~~~~~
- In file included from multicont_stubs.c:6:
- /home/opam/.opam/default/lib/ocaml/caml/fiber.h:312:20: note: declared here
-   312 | struct stack_info* caml_alloc_stack_noexc(mlsize_t wosize, value hval,
-       |                    ^~~~~~~~~~~~~~~~~~~~~~
- multicont_stubs.c:123:77: error: passing argument 3 of 'caml_rewrite_exception_stack' from incompatible pointer type [-Wincompatible-pointer-types]
-   123 |       caml_rewrite_exception_stack(current, (value**)&clone->exception_ptr, clone);
-       |                                                                             ^~~~~
-       |                                                                             |
-       |                                                                             struct stack_info *
- /home/opam/.opam/default/lib/ocaml/caml/fiber.h:344:55: note: expected 'value **' {aka 'long int **'} but argument is of type 'struct stack_info *'
-   344 |                              value** exn_ptr, value** async_exn_ptr,
-       |                                               ~~~~~~~~^~~~~~~~~~~~~
- multicont_stubs.c:123:7: error: too few arguments to function 'caml_rewrite_exception_stack'
-   123 |       caml_rewrite_exception_stack(current, (value**)&clone->exception_ptr, clone);
-       |       ^~~~~~~~~~~~~~~~~~~~~~~~~~~~
- /home/opam/.opam/default/lib/ocaml/caml/fiber.h:343:1: note: declared here
-   343 | caml_rewrite_exception_stack(struct stack_info *old_stack,
-       | ^~~~~~~~~~~~~~~~~~~~~~~~~~~~
build failed... 

=== STDERR ===

2026-10-07 21:38.28: FAILED: build multicont.1.0.3
2026-10-07 21:38.28: Job failed: build failed: multicont.1.0.3