Build:
- 0
2026-10-07 21:45.49: New job: build mpg123.0.3 (769fb3bae8f8)
2026-10-07 21:45.49: Waiting for resource in pool day11-builds
2026-10-07 21:51.57: Got resource from pool day11-builds
2026-10-07 21:51.57: [profile oxcaml-odoc-master] build mpg123.0.3
2026-10-07 21:51.58: build mpg123.0.3 (769fb3bae8f8)
=== DEPENDENCIES (18 transitive) ===
base-threads.base 464810371b96
base-unix.base 4596d20d2cf7
conf-autoconf.1 8ee1e3913008
conf-libffi.2.0.0 3b04165a8510
conf-libmpg123.1 7cfd36fa8c13
conf-pkg-config.5 e39f7209b38f
conf-which.1 65c43ca119c3
csexp.1.5.2 4dac08a488e7
ctypes.0.24.0+ox 5b7e8d079159
ctypes-foreign.0.24.0+ox e9b014f659e6
dune.3.22.2+ox a601158acc62
dune-configurator.3.22.2+ox cc2e07190f84
integers.0.8.0 0dc28eefa67d
ocaml.5.2.0 b8c350f4f1ad
ocaml-config.3 2c72b422dfc3
ocaml-variants.5.2.0+ox 60cb73ac7801
oxcaml-compiler.5.2.0minus39 c47b62237187
stdlib-shims.0.3.0 d2e8875350ba
=== STDOUT ===
Processing: [default: loading data]
[mpg123.0.3: dl]
[mpg123.0.3: extract]
-> retrieved mpg123.0.3 (https://opam.ocaml.org/cache)
[mpg123: dune build]
+ /home/opam/.opam/default/bin/dune "build" "-p" "mpg123" "-j" "39" "@install" (CWD=/home/opam/.opam/default/.opam-switch/build/mpg123.0.3)
- (cd _build/default/c && /usr/bin/sh -c 'gcc -O2 -fno-strict-aliasing -fwrapv -pthread -fPIC -pthread c_generated_types.c -I '\''/home/opam/.opam/default/lib/ctypes'\'' -I /home/opam/.opam/default/lib/ocaml -I/usr/include/x86_64-linux-gnu -o c_generated_types.exe')
- In file included from /home/opam/.opam/default/lib/ctypes/ctypes_primitives.h:16,
- from /home/opam/.opam/default/lib/ctypes/ctypes_cstubs_internals.h:13,
- from c_generated_types.c:4:
- /home/opam/.opam/default/lib/ctypes/ocaml_integers.h:37:9: warning: "Int8_val" redefined
- 37 | #define Int8_val(V) ((int8_t)(Int_val(V)))
- | ^~~~~~~~
- In file included from /home/opam/.opam/default/lib/ctypes/ocaml_integers.h:11:
- /home/opam/.opam/default/lib/ocaml/caml/mlvalues.h:154:9: note: this is the location of the previous definition
- 154 | #define Int8_val(x) ((int8_t) Long_val(x))
- | ^~~~~~~~
- /home/opam/.opam/default/lib/ctypes/ocaml_integers.h:38:9: warning: "Int16_val" redefined
- 38 | #define Int16_val(V) ((int16_t)(Int_val(V)))
- | ^~~~~~~~~
- /home/opam/.opam/default/lib/ocaml/caml/mlvalues.h:153:9: note: this is the location of the previous definition
- 153 | #define Int16_val(x) ((int16_t) Long_val(x))
- | ^~~~~~~~~
- File "c/dune", line 66, characters 11-32:
- 66 | (names c_generated_functions)
- ^^^^^^^^^^^^^^^^^^^^^
- (cd _build/default/c && /usr/bin/gcc -O2 -fno-strict-aliasing -fwrapv -pthread -fPIC -pthread -D_FILE_OFFSET_BITS=64 -I/usr/include/x86_64-linux-gnu -g -I /home/opam/.opam/default/lib/ocaml -I /home/opam/.opam/default/lib/ctypes -I /home/opam/.opam/default/lib/integers -I /home/opam/.opam/default/lib/stdlib-shims -I . -o c_generated_functions.o -c c_generated_functions.c)
- In file included from /home/opam/.opam/default/lib/ctypes/ctypes_primitives.h:16,
- from /home/opam/.opam/default/lib/ctypes/ctypes_cstubs_internals.h:13,
- from c_generated_functions.c:2:
- /home/opam/.opam/default/lib/ctypes/ocaml_integers.h:37:9: warning: "Int8_val" redefined
- 37 | #define Int8_val(V) ((int8_t)(Int_val(V)))
- | ^~~~~~~~
- In file included from /home/opam/.opam/default/lib/ctypes/ocaml_integers.h:11:
- /home/opam/.opam/default/lib/ocaml/caml/mlvalues.h:154:9: note: this is the location of the previous definition
- 154 | #define Int8_val(x) ((int8_t) Long_val(x))
- | ^~~~~~~~
- /home/opam/.opam/default/lib/ctypes/ocaml_integers.h:38:9: warning: "Int16_val" redefined
- 38 | #define Int16_val(V) ((int16_t)(Int_val(V)))
- | ^~~~~~~~~
- /home/opam/.opam/default/lib/ocaml/caml/mlvalues.h:153:9: note: this is the location of the previous definition
- 153 | #define Int16_val(x) ((int16_t) Long_val(x))
- | ^~~~~~~~~
- c_generated_functions.c: In function 'mpg123_stub_8_mpg123_decoders':
- c_generated_functions.c:77:17: error: initialization of 'char **' from incompatible pointer type 'const char **' [-Wincompatible-pointer-types]
- 77 | char** x46 = mpg123_decoders();
- | ^~~~~~~~~~~~~~~
- c_generated_functions.c: In function 'mpg123_stub_9_mpg123_supported_decoders':
- c_generated_functions.c:86:17: error: initialization of 'char **' from incompatible pointer type 'const char **' [-Wincompatible-pointer-types]
- 86 | char** x51 = mpg123_supported_decoders();
- | ^~~~~~~~~~~~~~~~~~~~~~~~~
- c_generated_functions.c: In function 'mpg123_stub_14_mpg123_read':
- c_generated_functions.c:141:41: error: passing argument 4 of 'mpg123_read' from incompatible pointer type [-Wincompatible-pointer-types]
- 141 | int x93 = mpg123_read(x87, x88, x89, x92);
- | ^~~
- | |
- | int *
- In file included from c_generated_functions.c:1:
- /usr/include/x86_64-linux-gnu/mpg123.h:828:53: note: expected 'size_t *' {aka 'long unsigned int *'} but argument is of type 'int *'
- 828 | , void *outmemory, size_t outmemsize, size_t *done );
- | ~~~~~~~~^~~~
- c_generated_functions.c: In function 'mpg123_stub_20_mpg123_getformat':
- c_generated_functions.c:207:38: error: passing argument 2 of 'mpg123_getformat' from incompatible pointer type [-Wincompatible-pointer-types]
- 207 | int x139 = mpg123_getformat(x135, x136, x137, x138);
- | ^~~~
- | |
- | int *
- /usr/include/x86_64-linux-gnu/mpg123.h:692:15: note: expected 'long int *' but argument is of type 'int *'
- 692 | , long *rate, int *channels, int *encoding );
- | ~~~~~~^~~~
[ERROR] The compilation of mpg123.0.3 failed at "dune build -p mpg123 -j 39 @install".
build failed...
=== STDERR ===
2026-10-07 21:52.11: FAILED: build mpg123.0.3
2026-10-07 21:52.11: Job failed: build failed: mpg123.0.3