Build:
- 0
2026-10-07 22:39.56: New job: build guile.1.0 (f57302ead61e)
2026-10-07 22:39.56: Waiting for resource in pool day11-builds
2026-10-07 22:42.32: Got resource from pool day11-builds
2026-10-07 22:42.32: [profile oxcaml-odoc-master] build guile.1.0
2026-10-07 22:42.32: build guile.1.0 (f57302ead61e)
=== DEPENDENCIES (54 transitive) ===
astring.0.8.5 7c8857421a13
base.v0.18~preview.130.106+341 f34ddf2e619a
base-threads.base 464810371b96
base-unix.base 4596d20d2cf7
base_internalhash_types.v0.18~preview.130.106+341 be0b254ff176
basement.v0.18~preview.130.106+341 8604678cfbc7
camlp-streams.5.0.1 3fd7878a34f1
capsule0.v0.18~preview.130.106+341 f88d9c626f70
conf-autoconf.1 8ee1e3913008
conf-gmp.5 c2adbec9a470
conf-guile.1 7e40b24cf3a9
conf-libffi.2.0.0 3b04165a8510
conf-pkg-config.5 e39f7209b38f
conf-which.1 65c43ca119c3
csexp.1.5.2 4dac08a488e7
ctypes.0.24.0+ox 5b7e8d079159
ctypes-foreign.0.24.0+ox e9b014f659e6
dune.3.22.2+ox a601158acc62
dune-configurator.3.22.2+ox cc2e07190f84
integers.0.8.0 0dc28eefa67d
nonempty_list_type.v0.18~preview.130.106+341 627762658405
num.1.6 7a36ed3a3fba
ocaml.5.2.0 b8c350f4f1ad
ocaml-compiler-libs.v0.17.0+ox 97d1a68258b8
ocaml-config.3 2c72b422dfc3
ocaml-variants.5.2.0+ox 60cb73ac7801
ocaml_intrinsics_kernel.v0.18~preview.130.106+341 c40a90c1d0a0
ocamlbuild.0.16.1+ox de5a5462a208
ocamlfind.1.9.8+ox 70bd5761d4de
odoc-parser.3.2.1+master.1790607351.6dc5826 c6266b0f3b72
oxcaml-compiler.5.2.0minus39 c47b62237187
parsexp.v0.18~preview.130.106+341 ad5057b95363
ppx_array_base.v0.18~preview.130.106+341 c51a4870bed2
ppx_base.v0.18~preview.130.106+341 012114ba4619
ppx_compare.v0.18~preview.130.106+341 d83ea7a9babf
ppx_derivers.1.2.1 c1e05b615770
ppx_enumerate.v0.18~preview.130.106+341 19ec0b1ce719
ppx_globalize.v0.18~preview.130.106+341 cbfff4b7612d
ppx_hash.v0.18~preview.130.106+341 5606540288ea
ppx_helpers.v0.18~preview.130.106+341 8dd54ab8be81
ppx_js_style.v0.18~preview.130.106+341 feee3f181f35
ppx_sexp_conv.v0.18~preview.130.106+341 830b9004c4b6
ppx_shorthand.v0.18~preview.130.106+341 ad51e35d11cd
ppx_template.v0.18~preview.130.106+341 bf88e4b3bbb7
ppxlib.0.33.0+ox2 ef722ad5d5dd
ppxlib_ast.0.33.0+ox2 5b4eb2b67c22
ppxlib_jane.v0.18~preview.130.106+341 1e31a89a4747
sexp_type.v0.18~preview.130.106+341 3ddf0ba1a078
sexplib.v0.18~preview.130.106+341 5fc91c301829
sexplib0.v0.18~preview.130.106+341 3c1103d71fd3
stdio.v0.18~preview.130.106+341 28fefb5828cc
stdlib-shims.0.3.0 d2e8875350ba
topkg.1.1.1+ox 76d82ba7f921
unique.v0.18~preview.130.106+341 7d7e7f3934f3
=== STDOUT ===
Processing: [default: loading data]
[guile.1.0: dl]
[guile.1.0: extract]
-> retrieved guile.1.0 (https://opam.ocaml.org/cache)
[guile: dune build]
+ /home/opam/.opam/default/bin/dune "build" "-p" "guile" "-j" "39" "--promote-install-files=false" "@install" (CWD=/home/opam/.opam/default/.opam-switch/build/guile.1.0)
- File "stubgen/dune", lines 12-16, characters 0-263:
- 12 | (rule (targets bindings_stubs_gen.exe)
- 13 | (deps bindings_stubs_gen.c c_flags c_library_flags)
- 14 | (action
- 15 | (bash
- 16 | "%{cc} bindings_stubs_gen.c -I `dirname %{lib:ctypes:ctypes_cstubs_internals.h}` -I %{ocaml_where} $(< c_flags) $(< c_library_flags) -o %{targets}")))
- (cd _build/default/stubgen && /usr/bin/bash -e -u -o pipefail -c 'gcc -O2 -fno-strict-aliasing -fwrapv -pthread -fPIC -pthread -D_FILE_OFFSET_BITS=64 -Wall -fdiagnostics-color=always bindings_stubs_gen.c -I `dirname /home/opam/.opam/default/lib/ctypes/ctypes_cstubs_internals.h` -I /home/opam/.opam/default/lib/ocaml $(< c_flags) $(< c_library_flags) -o bindings_stubs_gen.exe')
- In file included from /home/opam/.opam/default/lib/ctypes/ctypes_primitives.h:16,
- from /home/opam/.opam/default/lib/ctypes/ctypes_cstubs_internals.h:13,
- from bindings_stubs_gen.c:6:
- /home/opam/.opam/default/lib/ctypes/ocaml_integers.h:37:9: warning: "Int8_val" redefined
- 37 | #define Int8_val(V) ((int8_t)(Int_val(V)))
- | ^~~~~~~~
- In file included from /home/opam/.opam/default/lib/ctypes/ocaml_integers.h:11:
- /home/opam/.opam/default/lib/ocaml/caml/mlvalues.h:154:9: note: this is the location of the previous definition
- 154 | #define Int8_val(x) ((int8_t) Long_val(x))
- | ^~~~~~~~
- /home/opam/.opam/default/lib/ctypes/ocaml_integers.h:38:9: warning: "Int16_val" redefined
- 38 | #define Int16_val(V) ((int16_t)(Int_val(V)))
- | ^~~~~~~~~
- /home/opam/.opam/default/lib/ocaml/caml/mlvalues.h:153:9: note: this is the location of the previous definition
- 153 | #define Int16_val(x) ((int16_t) Long_val(x))
- | ^~~~~~~~~
- bindings_stubs_gen.c: In function 'main':
- bindings_stubs_gen.c:35:41: warning: cast from pointer to integer of different size [-Wpointer-to-int-cast]
- 35 | enum { check_SCM_UNDEFINED_const = (int)SCM_UNDEFINED };
- | ^
- bindings_stubs_gen.c:36:19: error: initialization of 'intptr_t' {aka 'long int'} from 'struct scm_unused_struct *' makes integer from pointer without a cast [-Wint-conversion]
- 36 | intptr_t v = (SCM_UNDEFINED);
- | ^
- bindings_stubs_gen.c:42:35: warning: cast from pointer to integer of different size [-Wpointer-to-int-cast]
- 42 | enum { check_SCM_EOL_const = (int)SCM_EOL };
- | ^
- bindings_stubs_gen.c:43:19: error: initialization of 'intptr_t' {aka 'long int'} from 'struct scm_unused_struct *' makes integer from pointer without a cast [-Wint-conversion]
- 43 | intptr_t v = (SCM_EOL);
- | ^
- bindings_stubs_gen.c:49:38: warning: cast from pointer to integer of different size [-Wpointer-to-int-cast]
- 49 | enum { check_SCM_BOOL_T_const = (int)SCM_BOOL_T };
- | ^
- bindings_stubs_gen.c:50:19: error: initialization of 'intptr_t' {aka 'long int'} from 'struct scm_unused_struct *' makes integer from pointer without a cast [-Wint-conversion]
- 50 | intptr_t v = (SCM_BOOL_T);
- | ^
- bindings_stubs_gen.c:56:38: warning: cast from pointer to integer of different size [-Wpointer-to-int-cast]
- 56 | enum { check_SCM_BOOL_F_const = (int)SCM_BOOL_F };
- | ^
- bindings_stubs_gen.c:57:19: error: initialization of 'intptr_t' {aka 'long int'} from 'struct scm_unused_struct *' makes integer from pointer without a cast [-Wint-conversion]
- 57 | intptr_t v = (SCM_BOOL_F);
- | ^
[ERROR] The compilation of guile.1.0 failed at "dune build -p guile -j 39 --promote-install-files=false @install".
build failed...
=== STDERR ===
2026-10-07 22:43.04: FAILED: build guile.1.0
2026-10-07 22:43.04: Job failed: build failed: guile.1.0