Build:
  1. 0
2026-10-07 22:43.07: New job: build mysql8.1.0 (27f34c14a50e)
2026-10-07 22:43.07: Waiting for resource in pool day11-builds
2026-10-07 22:55.17: Got resource from pool day11-builds
2026-10-07 22:55.17: [profile oxcaml-odoc-master] build mysql8.1.0
2026-10-07 22:55.17: build mysql8.1.0 (27f34c14a50e)
=== DEPENDENCIES (43 transitive) ===
  base.v0.18~preview.130.83+317                      9d35b30f6157
  base-threads.base                                  464810371b96
  base-unix.base                                     4596d20d2cf7
  basement.v0.18~preview.130.83+317                  fd9c48ddc186
  capsule0.v0.18~preview.130.83+317                  3d1efd5b4012
  conf-autoconf.1                                    8ee1e3913008
  conf-mysql.1                                       40ddb771fc98
  conf-which.1                                       65c43ca119c3
  csexp.1.5.2                                        388a0f161b43
  dune.3.22.2+ox                                     32ff52c6657f
  dune-configurator.3.22.2+ox                        ff0f95dfc767
  jane-street-headers.v0.18~preview.130.83+317       6835ed291f4e
  jst-config.v0.18~preview.130.83+317                f6381fca10dc
  ocaml.5.2.0                                        af0590f41c06
  ocaml-compiler-libs.v0.17.0+ox                     b65c7a1ffa7d
  ocaml-config.3                                     652553152315
  ocaml-variants.5.2.0+ox                            cb60d024b20c
  ocaml_intrinsics_kernel.v0.18~preview.130.83+317   1a69a7740305
  oxcaml-compiler.5.2.0minus25                       1356a22c5761
  ppx_array_base.v0.18~preview.130.83+317            b801fec98657
  ppx_assert.v0.18~preview.130.83+317                7c5b38716698
  ppx_base.v0.18~preview.130.83+317                  16b30b65ad1f
  ppx_cold.v0.18~preview.130.83+317                  d2ee8aec553e
  ppx_compare.v0.18~preview.130.83+317               617e9368d46c
  ppx_derivers.1.2.1                                 91b7c666f6fd
  ppx_enumerate.v0.18~preview.130.83+317             86b9cb393d03
  ppx_globalize.v0.18~preview.130.83+317             da9e2819134d
  ppx_hash.v0.18~preview.130.83+317                  69f598a0172a
  ppx_helpers.v0.18~preview.130.83+317               5dbce1ab0bca
  ppx_here.v0.18~preview.130.83+317                  45198b2bc5e0
  ppx_inline_test.v0.18~preview.130.83+317           cb25afe71f6f
  ppx_optcomp.v0.18~preview.130.83+317               c47bbc308d92
  ppx_sexp_conv.v0.18~preview.130.83+317             df76435894ca
  ppx_shorthand.v0.18~preview.130.83+317             72f22e3c90d0
  ppx_template.v0.18~preview.130.83+317              96a070b82ff1
  ppxlib.0.33.0+ox                                   5a44f0664338
  ppxlib_ast.0.33.0+ox                               c27d0426e5a8
  ppxlib_jane.v0.18~preview.130.83+317               0bcd9248dbfd
  sexp_type.v0.18~preview.130.83+317                 9468879d684c
  sexplib0.v0.18~preview.130.83+317                  022cce933120
  stdio.v0.18~preview.130.83+317                     48ca66bc8f6d
  stdlib-shims.0.3.0                                 e6cbb74541c0
  time_now.v0.18~preview.130.83+317                  b82d8afebcc7
=== STDOUT ===
Processing: [default: loading data]
[mysql8.1.0: dl]
[mysql8.1.0: extract]
-> retrieved mysql8.1.0  (https://opam.ocaml.org/cache)
[mysql8: dune build]
+ /home/opam/.opam/default/bin/dune "build" "-p" "mysql8" "-j" "39" (CWD=/home/opam/.opam/default/.opam-switch/build/mysql8.1.0)
- File "lib/dune", line 4, characters 10-22:
- 4 |  (c_names mysql8_stubs)
-               ^^^^^^^^^^^^
- (cd _build/default/lib && /usr/bin/gcc -O2 -fno-strict-aliasing -fwrapv -pthread -fPIC -pthread -D_FILE_OFFSET_BITS=64 -g -I /home/opam/.opam/default/lib/ocaml -I /home/opam/.opam/default/lib/base -I /home/opam/.opam/default/lib/base/shadow_stdlib -I /home/opam/.opam/default/lib/basement -I /home/opam/.opam/default/lib/capsule0/expert -I /home/opam/.opam/default/lib/jane-street-headers -I /home/opam/.opam/default/lib/ocaml_intrinsics_kernel -I /home/opam/.opam/default/lib/ppx_compare/runtime-lib -I /home/opam/.opam/default/lib/ppx_enumerate/runtime-lib -I /home/opam/.opam/default/lib/ppx_hash/base_internalhash_types -I /home/opam/.opam/default/lib/ppx_hash/runtime-lib -I /home/opam/.opam/default/lib/ppx_inline_test/config -I /home/opam/.opam/default/lib/ppx_inline_test/runtime-lib -I /home/opam/.opam/default/lib/ppx_sexp_conv/runtime-lib -I /home/opam/.opam/default/lib/sexp_type -I /home/opam/.opam/default/lib/sexp_type/grammar -I /home/opam/.opam/default/lib/sexplib0 -I /home/opam/.opam/default/lib/time_now -o mysql8_stubs.o -c mysql8_stubs.c)
- mysql8_stubs.c:38:10: fatal error: mysql.h: No such file or directory
-    38 | #include <mysql.h>
-       |          ^~~~~~~~~
- compilation terminated.
- (cd _build/default && /home/opam/.opam/default/bin/ocamlc.opt -w -40 -g -bin-annot -bin-annot-occurrences -bin-annot-cms -I lib/.mysql8.objs/byte -I /home/opam/.opam/default/lib/base -I /home/opam/.opam/default/lib/base/shadow_stdlib -I /home/opam/.opam/default/lib/basement -I /home/opam/.opam/default/lib/capsule0/expert -I /home/opam/.opam/default/lib/jane-street-headers -I /home/opam/.opam/default/lib/ocaml_intrinsics_kernel -I /home/opam/.opam/default/lib/ppx_compare/runtime-lib -I /home/opam/.opam/default/lib/ppx_enumerate/runtime-lib -I /home/opam/.opam/default/lib/ppx_hash/base_internalhash_types -I /home/opam/.opam/default/lib/ppx_hash/runtime-lib -I /home/opam/.opam/default/lib/ppx_inline_test/config -I /home/opam/.opam/default/lib/ppx_inline_test/runtime-lib -I /home/opam/.opam/default/lib/ppx_sexp_conv/runtime-lib -I /home/opam/.opam/default/lib/sexp_type -I /home/opam/.opam/default/lib/sexp_type/grammar -I /home/opam/.opam/default/lib/sexplib0 -I /home/opam/.opam/default/lib/time_now -cmi-file lib/.mysql8.objs/byte/mysql8.cmi -no-alias-deps -o lib/.mysql8.objs/byte/mysql8.cmo -c -impl lib/mysql8.pp.ml)
- File "lib/mysql8.ml", line 34, characters 8-35:
- 34 | let _ = Callback.register_exception "mysql error" (Error "Registering Callback")
-              ^^^^^^^^^^^^^^^^^^^^^^^^^^^
- Alert unsafe_multidomain: Stdlib.Callback.register_exception
- Use [Callback.Safe.register_exception].
- (cd _build/default && /home/opam/.opam/default/bin/ocamlopt.opt -w -40 -g -I lib/.mysql8.objs/byte -I lib/.mysql8.objs/native -I /home/opam/.opam/default/lib/base -I /home/opam/.opam/default/lib/base/shadow_stdlib -I /home/opam/.opam/default/lib/basement -I /home/opam/.opam/default/lib/capsule0/expert -I /home/opam/.opam/default/lib/jane-street-headers -I /home/opam/.opam/default/lib/ocaml_intrinsics_kernel -I /home/opam/.opam/default/lib/ppx_compare/runtime-lib -I /home/opam/.opam/default/lib/ppx_enumerate/runtime-lib -I /home/opam/.opam/default/lib/ppx_hash/base_internalhash_types -I /home/opam/.opam/default/lib/ppx_hash/runtime-lib -I /home/opam/.opam/default/lib/ppx_inline_test/config -I /home/opam/.opam/default/lib/ppx_inline_test/runtime-lib -I /home/opam/.opam/default/lib/ppx_sexp_conv/runtime-lib -I /home/opam/.opam/default/lib/sexp_type -I /home/opam/.opam/default/lib/sexp_type/grammar -I /home/opam/.opam/default/lib/sexplib0 -I /home/opam/.opam/default/lib/time_now -cmi-file lib/.mysql8.objs/byte/mysql8.cmi -no-alias-deps -o lib/.mysql8.objs/native/mysql8.cmx -c -impl lib/mysql8.pp.ml)
- File "lib/mysql8.ml", line 34, characters 8-35:
- 34 | let _ = Callback.register_exception "mysql error" (Error "Registering Callback")
-              ^^^^^^^^^^^^^^^^^^^^^^^^^^^
- Alert unsafe_multidomain: Stdlib.Callback.register_exception
- Use [Callback.Safe.register_exception].
[ERROR] The compilation of mysql8.1.0 failed at "dune build -p mysql8 -j 39".
build failed... 

=== STDERR ===

2026-10-07 22:55.37: FAILED: build mysql8.1.0
2026-10-07 22:55.37: Job failed: build failed: mysql8.1.0