Build:
  1. 0
2026-10-07 23:23.06: New job: build mysql8.1.0 (4f1759842f77)
2026-10-07 23:23.06: Waiting for resource in pool day11-builds
2026-10-07 23:30.49: Got resource from pool day11-builds
2026-10-07 23:30.49: [profile oxcaml-odoc-master] build mysql8.1.0
2026-10-07 23:30.50: build mysql8.1.0 (4f1759842f77)
=== DEPENDENCIES (43 transitive) ===
  base.v0.18~preview.130.106+341                     f34ddf2e619a
  base-threads.base                                  464810371b96
  base-unix.base                                     4596d20d2cf7
  base_internalhash_types.v0.18~preview.130.106+341  be0b254ff176
  basement.v0.18~preview.130.106+341                 8604678cfbc7
  capsule0.v0.18~preview.130.106+341                 f88d9c626f70
  conf-autoconf.1                                    8ee1e3913008
  conf-mysql.1                                       40ddb771fc98
  conf-which.1                                       65c43ca119c3
  csexp.1.5.2                                        4dac08a488e7
  dune.3.22.2+ox                                     a601158acc62
  dune-configurator.3.22.2+ox                        cc2e07190f84
  jane-street-headers.v0.18~preview.130.106+341      8786978bb115
  jst-config.v0.18~preview.130.106+341               244ae34a32cf
  nonempty_list_type.v0.18~preview.130.106+341       627762658405
  ocaml.5.2.0                                        b8c350f4f1ad
  ocaml-compiler-libs.v0.17.0+ox                     97d1a68258b8
  ocaml-config.3                                     2c72b422dfc3
  ocaml-variants.5.2.0+ox                            60cb73ac7801
  ocaml_intrinsics_kernel.v0.18~preview.130.106+341  c40a90c1d0a0
  oxcaml-compiler.5.2.0minus39                       c47b62237187
  ppx_array_base.v0.18~preview.130.106+341           c51a4870bed2
  ppx_assert.v0.18~preview.130.106+341               f00da84f1489
  ppx_base.v0.18~preview.130.106+341                 012114ba4619
  ppx_compare.v0.18~preview.130.106+341              d83ea7a9babf
  ppx_derivers.1.2.1                                 c1e05b615770
  ppx_enumerate.v0.18~preview.130.106+341            19ec0b1ce719
  ppx_globalize.v0.18~preview.130.106+341            cbfff4b7612d
  ppx_hash.v0.18~preview.130.106+341                 5606540288ea
  ppx_helpers.v0.18~preview.130.106+341              8dd54ab8be81
  ppx_here.v0.18~preview.130.106+341                 3cf3fb8f0998
  ppx_inline_test.v0.18~preview.130.106+341          6f861e4369de
  ppx_optcomp.v0.18~preview.130.106+341              732d290eacbf
  ppx_sexp_conv.v0.18~preview.130.106+341            830b9004c4b6
  ppx_shorthand.v0.18~preview.130.106+341            ad51e35d11cd
  ppx_template.v0.18~preview.130.106+341             bf88e4b3bbb7
  ppxlib.0.33.0+ox2                                  ef722ad5d5dd
  ppxlib_ast.0.33.0+ox2                              5b4eb2b67c22
  ppxlib_jane.v0.18~preview.130.106+341              1e31a89a4747
  sexp_type.v0.18~preview.130.106+341                3ddf0ba1a078
  sexplib0.v0.18~preview.130.106+341                 3c1103d71fd3
  stdlib-shims.0.3.0                                 d2e8875350ba
  time_now.v0.18~preview.130.106+341                 3426f731f199
=== STDOUT ===
Processing: [default: loading data]
[mysql8.1.0: dl]
[mysql8.1.0: extract]
-> retrieved mysql8.1.0  (https://opam.ocaml.org/cache)
[mysql8: dune build]
+ /home/opam/.opam/default/bin/dune "build" "-p" "mysql8" "-j" "39" (CWD=/home/opam/.opam/default/.opam-switch/build/mysql8.1.0)
- File "lib/dune", line 4, characters 10-22:
- 4 |  (c_names mysql8_stubs)
-               ^^^^^^^^^^^^
- (cd _build/default/lib && /usr/bin/gcc -O2 -fno-strict-aliasing -fwrapv -pthread -fPIC -pthread -D_FILE_OFFSET_BITS=64 -g -I /home/opam/.opam/default/lib/ocaml -I /home/opam/.opam/default/lib/base -I /home/opam/.opam/default/lib/base/shadow_stdlib -I /home/opam/.opam/default/lib/base_internalhash_types -I /home/opam/.opam/default/lib/basement -I /home/opam/.opam/default/lib/capsule0/prim -I /home/opam/.opam/default/lib/jane-street-headers -I /home/opam/.opam/default/lib/nonempty_list_type -I /home/opam/.opam/default/lib/ocaml_intrinsics_kernel -I /home/opam/.opam/default/lib/ppx_compare/runtime-lib -I /home/opam/.opam/default/lib/ppx_enumerate/runtime-lib -I /home/opam/.opam/default/lib/ppx_hash/runtime-lib -I /home/opam/.opam/default/lib/ppx_inline_test/config -I /home/opam/.opam/default/lib/ppx_inline_test/runtime-lib -I /home/opam/.opam/default/lib/ppx_sexp_conv/runtime-lib -I /home/opam/.opam/default/lib/sexp_type -I /home/opam/.opam/default/lib/sexp_type/grammar -I /home/opam/.opam/default/lib/sexplib0 -I /home/opam/.opam/default/lib/time_now -o mysql8_stubs.o -c mysql8_stubs.c)
- mysql8_stubs.c:38:10: fatal error: mysql.h: No such file or directory
-    38 | #include <mysql.h>
-       |          ^~~~~~~~~
- compilation terminated.
- (cd _build/default && /home/opam/.opam/default/bin/ocamlc.opt -w -40 -g -bin-annot -bin-annot-occurrences -bin-annot-cms -I lib/.mysql8.objs/byte -I /home/opam/.opam/default/lib/base -I /home/opam/.opam/default/lib/base/shadow_stdlib -I /home/opam/.opam/default/lib/base_internalhash_types -I /home/opam/.opam/default/lib/basement -I /home/opam/.opam/default/lib/capsule0/prim -I /home/opam/.opam/default/lib/jane-street-headers -I /home/opam/.opam/default/lib/nonempty_list_type -I /home/opam/.opam/default/lib/ocaml_intrinsics_kernel -I /home/opam/.opam/default/lib/ppx_compare/runtime-lib -I /home/opam/.opam/default/lib/ppx_enumerate/runtime-lib -I /home/opam/.opam/default/lib/ppx_hash/runtime-lib -I /home/opam/.opam/default/lib/ppx_inline_test/config -I /home/opam/.opam/default/lib/ppx_inline_test/runtime-lib -I /home/opam/.opam/default/lib/ppx_sexp_conv/runtime-lib -I /home/opam/.opam/default/lib/sexp_type -I /home/opam/.opam/default/lib/sexp_type/grammar -I /home/opam/.opam/default/lib/sexplib0 -I /home/opam/.opam/default/lib/time_now -cmi-file lib/.mysql8.objs/byte/mysql8.cmi -no-alias-deps -o lib/.mysql8.objs/byte/mysql8.cmo -c -impl lib/mysql8.pp.ml)
- File "lib/mysql8.ml", line 34, characters 8-35:
- 34 | let _ = Callback.register_exception "mysql error" (Error "Registering Callback")
-              ^^^^^^^^^^^^^^^^^^^^^^^^^^^
- Alert unsafe_multidomain: Stdlib.Callback.register_exception
- Use [Callback.Safe.register_exception].
- (cd _build/default && /home/opam/.opam/default/bin/ocamlopt.opt -w -40 -g -I lib/.mysql8.objs/byte -I lib/.mysql8.objs/native -I /home/opam/.opam/default/lib/base -I /home/opam/.opam/default/lib/base/shadow_stdlib -I /home/opam/.opam/default/lib/base_internalhash_types -I /home/opam/.opam/default/lib/basement -I /home/opam/.opam/default/lib/capsule0/prim -I /home/opam/.opam/default/lib/jane-street-headers -I /home/opam/.opam/default/lib/nonempty_list_type -I /home/opam/.opam/default/lib/ocaml_intrinsics_kernel -I /home/opam/.opam/default/lib/ppx_compare/runtime-lib -I /home/opam/.opam/default/lib/ppx_enumerate/runtime-lib -I /home/opam/.opam/default/lib/ppx_hash/runtime-lib -I /home/opam/.opam/default/lib/ppx_inline_test/config -I /home/opam/.opam/default/lib/ppx_inline_test/runtime-lib -I /home/opam/.opam/default/lib/ppx_sexp_conv/runtime-lib -I /home/opam/.opam/default/lib/sexp_type -I /home/opam/.opam/default/lib/sexp_type/grammar -I /home/opam/.opam/default/lib/sexplib0 -I /home/opam/.opam/default/lib/time_now -cmi-file lib/.mysql8.objs/byte/mysql8.cmi -no-alias-deps -o lib/.mysql8.objs/native/mysql8.cmx -c -impl lib/mysql8.pp.ml)
- File "lib/mysql8.ml", line 34, characters 8-35:
- 34 | let _ = Callback.register_exception "mysql error" (Error "Registering Callback")
-              ^^^^^^^^^^^^^^^^^^^^^^^^^^^
- Alert unsafe_multidomain: Stdlib.Callback.register_exception
- Use [Callback.Safe.register_exception].
[ERROR] The compilation of mysql8.1.0 failed at "dune build -p mysql8 -j 39".
build failed... 

=== STDERR ===

2026-10-07 23:31.04: FAILED: build mysql8.1.0
2026-10-07 23:31.04: Job failed: build failed: mysql8.1.0