Build:
  1. 0
2026-10-21 16:53.27: New job: build metapp.0.4.4 (28f288e4080d)
2026-10-21 16:53.27: Waiting for resource in pool day11-builds
2026-10-21 16:53.27: Got resource from pool day11-builds
2026-10-21 16:53.27: [profile odoc-master-mini] build metapp.0.4.4
2026-10-21 16:53.27: build metapp.0.4.4 (28f288e4080d)
=== DEPENDENCIES (14 transitive) ===
  base-threads.base                                  ca51096a9c5b
  base-unix.base                                     88a83b7ed333
  dune.3.24.2                                        e0572fcd3a5c
  ocaml.5.3.0                                        92450889936d
  ocaml-base-compiler.5.3.0                          cdfe4719bb80
  ocaml-compiler.5.3.0                               c2fd8a2e2b36
  ocaml-compiler-libs.v0.17.0                        4bf56a360a8f
  ocaml-config.3                                     8168bc07a451
  ocamlfind.1.9.8                                    3f8ff7716be7
  ppx_derivers.1.2.1                                 816724a5a727
  ppxlib.0.35.0                                      48ff0cc03858
  sexplib0.v0.17.0                                   4722c993ecfd
  stdcompat.21.1                                     5d87de4a0caa
  stdlib-shims.0.3.0                                 5f888484bdf1
=== STDOUT ===
Processing: [default: loading data]
[metapp.0.4.4: dl]
[metapp.0.4.4: extract]
-> retrieved metapp.0.4.4  (https://opam.ocaml.org/cache)
[metapp: dune build]
+ /home/opam/.opam/default/bin/dune "build" "-p" "metapp" "-j" "39" "@install" (CWD=/home/opam/.opam/default/.opam-switch/build/metapp.0.4.4)
- (cd _build/default && .ppx/e17850eae66b6b5844e45f672bc501f8/ppx.exe --cookie 'library-name="metapp"' -o metapp/metapp.pp.mli --intf metapp/metapp.mli -corrected-suffix .ppx-corrected -diff-cmd - -dump-ast)
- File "_none_", line 1:
- Warning 58 [no-cmx-file]: no cmx file was found in path for module Metapp_api, and its interface was not compiled with -opaque
- 
- File "_none_", line 1:
- Warning 58 [no-cmx-file]: no cmx file was found in path for module Metapp_version_info, and its interface was not compiled with -opaque
- File "_none_", line 1:
- Error: error loading shared library: Failure("/tmp/build_2cc30a_dune/metapp592986.cmxs: failed to map segment from shared object")
- (cd _build/default && .ppx/e17850eae66b6b5844e45f672bc501f8/ppx.exe --cookie 'library-name="metapp"' -o metapp/metapp.pp.ml --impl metapp/metapp.ml -corrected-suffix .ppx-corrected -diff-cmd - -dump-ast)
- File "_none_", line 1:
- Warning 58 [no-cmx-file]: no cmx file was found in path for module Metapp_api, and its interface was not compiled with -opaque
- 
- File "_none_", line 1:
- Warning 58 [no-cmx-file]: no cmx file was found in path for module Metapp_preutils, and its interface was not compiled with -opaque
- 
- File "_none_", line 1:
- Warning 58 [no-cmx-file]: no cmx file was found in path for module Metapp_version_info, and its interface was not compiled with -opaque
- File "_none_", line 1:
- Error: error loading shared library: Failure("/tmp/build_2cc30a_dune/metappe69bab.cmxs: failed to map segment from shared object")
[ERROR] The compilation of metapp.0.4.4 failed at "dune build -p metapp -j 39 @install".
build failed... 

=== STDERR ===

2026-10-21 16:53.47: FAILED: build metapp.0.4.4
2026-10-21 16:53.47: Job failed: build failed: metapp.0.4.4