Build:
  1. 0
2026-10-24 10:13.21: New job: build torch.v0.18~preview.130.106+341 (ad3182d6c9c3)
2026-10-24 10:13.21: Waiting for resource in pool day11-builds
2026-10-24 10:14.01: Got resource from pool day11-builds
2026-10-24 10:14.01: [profile oxcaml-odoc-master] build torch.v0.18~preview.130.106+341
2026-10-24 10:14.01: build torch.v0.18~preview.130.106+341 (ad3182d6c9c3)
=== DEPENDENCIES (120 transitive) ===
  astring.0.8.5                                      e5dd4816ef4f
  base.v0.18~preview.130.106+341                     485b2e5eed2c
  base-threads.base                                  ca51096a9c5b
  base-unix.base                                     88a83b7ed333
  base_bigstring.v0.18~preview.130.106+341           4d2bb8babdcd
  base_internalhash_types.v0.18~preview.130.106+341  53c1d9dd3a6a
  base_quickcheck.v0.18~preview.130.106+341          07ffa63afeea
  basement.v0.18~preview.130.106+341                 e63b3ed84e10
  bin_prot.v0.18~preview.130.106+341                 e6d42b5243e1
  camlp-streams.5.0.1                                7cc244524881
  capitalization.v0.18~preview.130.106+341           4ac1881e827d
  capsule.v0.18~preview.130.106+341                  e938dd9f1695
  capsule0.v0.18~preview.130.106+341                 ad70f2c2efcf
  conf-autoconf.1                                    5ab3ab11f357
  conf-libffi.2.0.0                                  13818097de30
  conf-pkg-config.5                                  26be2768a637
  conf-which.1                                       e5dee02ff34e
  core.v0.18~preview.130.106+341                     4e2fc88bb5f6
  core_kernel.v0.18~preview.130.106+341              d4a2eca2bb09
  core_unix.v0.18~preview.130.106+341                fb1194f5b118
  csexp.1.5.2                                        cb8a070e4bb8
  ctypes.0.24.0+ox                                   27e431630617
  ctypes-foreign.0.24.0+ox                           5ecfc3c8d379
  dune.3.22.2+ox                                     5e749ffa929d
  dune-configurator.3.22.2+ox                        1a3907992cfa
  expect_test_helpers_base.v0.18~preview.130.106+341 da12676d1e8a
  expect_test_helpers_core.v0.18~preview.130.106+341 69c02deb8d9c
  fieldslib.v0.18~preview.130.106+341                2d0dbf04c222
  float_array.v0.18~preview.130.106+341              b9cef4fcacfe
  int_repr.v0.18~preview.130.106+341                 37f88033e797
  integers.0.8.0                                     96f1edb1660c
  jane-street-headers.v0.18~preview.130.106+341      d12e93a2daac
  janestreet_crc.v0.18~preview.130.106+341           1bcb0873d824
  jst-config.v0.18~preview.130.106+341               075b9999380f
  nonempty_list_type.v0.18~preview.130.106+341       a93d5e01bf82
  num.1.6                                            637252ddf3df
  ocaml.5.2.0                                        8c79aacf9a54
  ocaml-compiler-libs.v0.17.0+ox                     2c35fadd0dc1
  ocaml-config.3                                     8d947022d382
  ocaml-variants.5.2.0+ox                            8333b07a6d9d
  ocaml_intrinsics_kernel.v0.18~preview.130.106+341  1057e429191c
  ocamlbuild.0.16.1+ox                               8dbd88a95758
  ocamlfind.1.9.8+ox                                 ac5194292aef
  odoc-parser.3.2.1+master.1792831957.6747ca4        52f222696790
  oxcaml-compiler.5.2.0minus39                       bd8c89ffae9c
  parsexp.v0.18~preview.130.106+341                  2f422ba361a8
  portable.v0.18~preview.130.106+341                 2bf251ef733a
  ppx_array_base.v0.18~preview.130.106+341           dfd9832c21f8
  ppx_assert.v0.18~preview.130.106+341               498639ff6839
  ppx_base.v0.18~preview.130.106+341                 7872bfac9387
  ppx_bench.v0.18~preview.130.106+341                04060ee4706f
  ppx_bin_prot.v0.18~preview.130.106+341             06a27a85230d
  ppx_box.v0.18~preview.130.106+341                  aac0039626ab
  ppx_builtin.v0.18~preview.130.106+341              35ccc4bc23f6
  ppx_c_bindings.v0.18~preview.130.106+341           ac8a0f4a2e3f
  ppx_compare.v0.18~preview.130.106+341              c62826d163be
  ppx_custom_printf.v0.18~preview.130.106+341        dec4d87234b9
  ppx_debug_assert.v0.18~preview.130.106+341         2cc67f51ea00
  ppx_derivers.1.2.1                                 3398d25cc61e
  ppx_diff.v0.18~preview.130.106+341                 bccf4c800d7e
  ppx_disable_unused_warnings.v0.18~preview.130.106+341 beba72901571
  ppx_enumerate.v0.18~preview.130.106+341            1bd8161219cf
  ppx_expect.v0.18~preview.130.106+341               1d8a58c2743a
  ppx_fields_conv.v0.18~preview.130.106+341          0e80b6fb31f5
  ppx_fixed_literal.v0.18~preview.130.106+341        b956fc9d6327
  ppx_for_loop.v0.18~preview.130.106+341             ed9d9156447f
  ppx_fuelproof.v0.18~preview.130.106+341            0f30c1549fe4
  ppx_globalize.v0.18~preview.130.106+341            bbf4c41215ca
  ppx_hash.v0.18~preview.130.106+341                 d3c5a996b10b
  ppx_helpers.v0.18~preview.130.106+341              682759a9bf6e
  ppx_here.v0.18~preview.130.106+341                 24bba4b26935
  ppx_ignore_instrumentation.v0.18~preview.130.106+341 4466ea5d3426
  ppx_inline_test.v0.18~preview.130.106+341          242e76235aef
  ppx_int63_literal.v0.18~preview.130.106+341        823cd49f505e
  ppx_jane.v0.18~preview.130.106+341                 87f2d1bbca86
  ppx_js_style.v0.18~preview.130.106+341             8e14153729e1
  ppx_let.v0.18~preview.130.106+341                  f3975caedb5f
  ppx_log.v0.18~preview.130.106+341                  0d6cec9345bc
  ppx_module_timer.v0.18~preview.130.106+341         64fe3c29778b
  ppx_optcomp.v0.18~preview.130.106+341              acefe02ffc8d
  ppx_optional.v0.18~preview.130.106+341             7758222151b8
  ppx_pipebang.v0.18~preview.130.106+341             ed4f19df66a0
  ppx_portable.v0.18~preview.130.106+341             46ddaa896ada
  ppx_sexp_conv.v0.18~preview.130.106+341            80c39bab6e54
  ppx_sexp_message.v0.18~preview.130.106+341         28f2098e5627
  ppx_sexp_value.v0.18~preview.130.106+341           81c525528f76
  ppx_shorthand.v0.18~preview.130.106+341            32f433eaa783
  ppx_stable.v0.18~preview.130.106+341               3427de1d950a
  ppx_stable_witness.v0.18~preview.130.106+341       ad524eb9a26d
  ppx_string.v0.18~preview.130.106+341               b78f9ecfcf8d
  ppx_string_conv.v0.18~preview.130.106+341          bbb58fd21ef5
  ppx_template.v0.18~preview.130.106+341             83f8c9bac554
  ppx_tydi.v0.18~preview.130.106+341                 c90b7542a2ca
  ppx_typed_fields.v0.18~preview.130.106+341         9d75be0e7ac6
  ppx_typerep_conv.v0.18~preview.130.106+341         1450b7964709
  ppx_var_name.v0.18~preview.130.106+341             e88507c231c2
  ppx_variants_conv.v0.18~preview.130.106+341        cf61fdd70a22
  ppxlib.0.33.0+ox2                                  d85e811b7600
  ppxlib_ast.0.33.0+ox2                              0a0da3ee3d5b
  ppxlib_jane.v0.18~preview.130.106+341              ccc1153d985b
  re.1.14.0+ox                                       6719f0a1ce01
  seq.base                                           142155f3d570
  sexp_pretty.v0.18~preview.130.106+341              31064f69862e
  sexp_type.v0.18~preview.130.106+341                6b10198e4870
  sexplib.v0.18~preview.130.106+341                  02084e342f6e
  sexplib0.v0.18~preview.130.106+341                 7e00113f071c
  spawn.v0.15.1+ox                                   ec48eef56feb
  splittable_random.v0.18~preview.130.106+341        51562d1386a6
  stdio.v0.18~preview.130.106+341                    a3af2bab9b66
  stdlib-shims.0.3.0                                 0b775a14af43
  string_dict.v0.18~preview.130.106+341              9e81d53437ad
  time_now.v0.18~preview.130.106+341                 bc6b39b51afb
  topkg.1.1.1+ox                                     5a66baca869f
  typerep.v0.18~preview.130.106+341                  83090cdbe855
  unboxed.v0.18~preview.130.106+341                  9aad274f1a34
  unique.v0.18~preview.130.106+341                   f73457d6c8c3
  univ_map.v0.18~preview.130.106+341                 fcda08acfd59
  uopt.v0.18~preview.130.106+341                     744f1e85026c
  variantslib.v0.18~preview.130.106+341              a55202d0aa39
  vec.v0.18~preview.130.106+341                      b0c19983dbec
=== STDOUT ===
Processing: [default: loading data]
[torch.v0.18~preview.130.106+341: dl]
[torch.v0.18~preview.130.106+341: http]
[torch.v0.18~preview.130.106+341: extract]
-> retrieved torch.v0.18~preview.130.106+341  (https://github.com/janestreet/torch/archive/aa55b14cc44f065ec70849e008f170b9cd3a0199.tar.gz)
[torch: dune build]
+ /home/opam/.opam/default/bin/dune "build" "-p" "torch" "-j" "39" (CWD=/home/opam/.opam/default/.opam-switch/build/torch.v0.18~preview.130.106+341)
- (cd _build/default && /home/opam/.opam/default/bin/ocamlopt.opt -w -40 -g -I src/toplevel/.torch_toplevel.objs/byte -I src/toplevel/.torch_toplevel.objs/native -I /home/opam/.opam/default/lib/base -I /home/opam/.opam/default/lib/base/md5 -I /home/opam/.opam/default/lib/base/shadow_stdlib -I /home/opam/.opam/default/lib/base_internalhash_types -I /home/opam/.opam/default/lib/base_quickcheck -I /home/opam/.opam/default/lib/base_quickcheck/ppx_quickcheck/runtime -I /home/opam/.opam/default/lib/basement -I /home/opam/.opam/default/lib/bin_prot -I /home/opam/.opam/default/lib/bin_prot/shape -I /home/opam/.opam/default/lib/capsule -I /home/opam/.opam/default/lib/capsule0/blocking_sync -I /home/opam/.opam/default/lib/capsule0/prim -I /home/opam/.opam/default/lib/fieldslib -I /home/opam/.opam/default/lib/jane-street-headers -I /home/opam/.opam/default/lib/nonempty_list_type -I /home/opam/.opam/default/lib/ocaml-compiler-libs/toplevel -I /home/opam/.opam/default/lib/ocaml/compiler-libs -I /home/opam/.opam/default/lib/ocaml_intrinsics_kernel -I /home/opam/.opam/default/lib/parsexp -I /home/opam/.opam/default/lib/portable -I /home/opam/.opam/default/lib/portable/common -I /home/opam/.opam/default/lib/portable/kernel -I /home/opam/.opam/default/lib/ppx_assert/runtime-lib -I /home/opam/.opam/default/lib/ppx_bench/config -I /home/opam/.opam/default/lib/ppx_bench/config_types -I /home/opam/.opam/default/lib/ppx_bench/runtime-lib -I /home/opam/.opam/default/lib/ppx_compare/runtime-lib -I /home/opam/.opam/default/lib/ppx_enumerate/runtime-lib -I /home/opam/.opam/default/lib/ppx_expect/config -I /home/opam/.opam/default/lib/ppx_expect/config_types -I /home/opam/.opam/default/lib/ppx_expect/make_corrected_file -I /home/opam/.opam/default/lib/ppx_expect/make_corrected_file_kernel -I /home/opam/.opam/default/lib/ppx_expect/runtime -I /home/opam/.opam/default/lib/ppx_expect/runtime_types -I /home/opam/.opam/default/lib/ppx_fuelproof/runtime -I /home/opam/.opam/default/lib/ppx_hash/runtime-lib -I /home/opam/.opam/default/lib/ppx_here/runtime-lib -I /home/opam/.opam/default/lib/ppx_inline_test/config -I /home/opam/.opam/default/lib/ppx_inline_test/runtime-lib -I /home/opam/.opam/default/lib/ppx_log/syntax -I /home/opam/.opam/default/lib/ppx_log/types -I /home/opam/.opam/default/lib/ppx_module_timer/runtime -I /home/opam/.opam/default/lib/ppx_portable/runtime -I /home/opam/.opam/default/lib/ppx_sexp_conv/runtime-lib -I /home/opam/.opam/default/lib/ppx_stable_witness/runtime -I /home/opam/.opam/default/lib/ppx_stable_witness/stable_witness -I /home/opam/.opam/default/lib/ppx_string/runtime -I /home/opam/.opam/default/lib/ppx_string_conv/runtime -I /home/opam/.opam/default/lib/ppx_typed_fields/typed_fields_lib -I /home/opam/.opam/default/lib/ppx_typed_fields/typed_variants_lib -I /home/opam/.opam/default/lib/ppxlib/print_diff -I /home/opam/.opam/default/lib/ppxlib/stdppx -I /home/opam/.opam/default/lib/ppxlib_ast/stdppx -I /home/opam/.opam/default/lib/sexp_type -I /home/opam/.opam/default/lib/sexp_type/grammar -I /home/opam/.opam/default/lib/sexplib -I /home/opam/.opam/default/lib/sexplib0 -I /home/opam/.opam/default/lib/splittable_random -I /home/opam/.opam/default/lib/stdio -I /home/opam/.opam/default/lib/stdlib-shims -I /home/opam/.opam/default/lib/time_now -I /home/opam/.opam/default/lib/typerep -I /home/opam/.opam/default/lib/unique -I /home/opam/.opam/default/lib/variantslib -cmi-file src/toplevel/.torch_toplevel.objs/byte/torch_toplevel.cmi -no-alias-deps -o src/toplevel/.torch_toplevel.objs/native/torch_toplevel.cmx -c -impl src/toplevel/torch_toplevel.pp.ml)
- File "_none_", line 1:
- Warning 58 [no-cmx-file]: no cmx file was found in path for module Toploop, and its interface was not compiled with -opaque
- File "src/wrapper/dune", line 4, characters 9-18:
- 4 |   (names torch_api)
-              ^^^^^^^^^
- (cd _build/default/src/wrapper && /usr/bin/gcc -std=c++17 -fPIC -D_GLIBCXX_USE_CXX11_ABI=1 -g -I /home/opam/.opam/default/lib/ocaml -I /home/opam/.opam/default/lib/base -I /home/opam/.opam/default/lib/base/md5 -I /home/opam/.opam/default/lib/base/shadow_stdlib -I /home/opam/.opam/default/lib/base_internalhash_types -I /home/opam/.opam/default/lib/base_quickcheck -I /home/opam/.opam/default/lib/base_quickcheck/ppx_quickcheck/runtime -I /home/opam/.opam/default/lib/basement -I /home/opam/.opam/default/lib/bin_prot -I /home/opam/.opam/default/lib/bin_prot/shape -I /home/opam/.opam/default/lib/capsule -I /home/opam/.opam/default/lib/capsule0/blocking_sync -I /home/opam/.opam/default/lib/capsule0/prim -I /home/opam/.opam/default/lib/ctypes -I /home/opam/.opam/default/lib/ctypes-foreign -I /home/opam/.opam/default/lib/ctypes/stubs -I /home/opam/.opam/default/lib/fieldslib -I /home/opam/.opam/default/lib/integers -I /home/opam/.opam/default/lib/jane-street-headers -I /home/opam/.opam/default/lib/nonempty_list_type -I /home/opam/.opam/default/lib/ocaml/str -I /home/opam/.opam/default/lib/ocaml/threads -I /home/opam/.opam/default/lib/ocaml/unix -I /home/opam/.opam/default/lib/ocaml_intrinsics_kernel -I /home/opam/.opam/default/lib/parsexp -I /home/opam/.opam/default/lib/portable -I /home/opam/.opam/default/lib/portable/common -I /home/opam/.opam/default/lib/portable/kernel -I /home/opam/.opam/default/lib/ppx_assert/runtime-lib -I /home/opam/.opam/default/lib/ppx_bench/config -I /home/opam/.opam/default/lib/ppx_bench/config_types -I /home/opam/.opam/default/lib/ppx_bench/runtime-lib -I /home/opam/.opam/default/lib/ppx_compare/runtime-lib -I /home/opam/.opam/default/lib/ppx_enumerate/runtime-lib -I /home/opam/.opam/default/lib/ppx_expect/config -I /home/opam/.opam/default/lib/ppx_expect/config_types -I /home/opam/.opam/default/lib/ppx_expect/make_corrected_file -I /home/opam/.opam/default/lib/ppx_expect/make_corrected_file_kernel -I /home/opam/.opam/default/lib/ppx_expect/runtime -I /home/opam/.opam/default/lib/ppx_expect/runtime_types -I /home/opam/.opam/default/lib/ppx_fuelproof/runtime -I /home/opam/.opam/default/lib/ppx_hash/runtime-lib -I /home/opam/.opam/default/lib/ppx_here/runtime-lib -I /home/opam/.opam/default/lib/ppx_inline_test/config -I /home/opam/.opam/default/lib/ppx_inline_test/runtime-lib -I /home/opam/.opam/default/lib/ppx_log/syntax -I /home/opam/.opam/default/lib/ppx_log/types -I /home/opam/.opam/default/lib/ppx_module_timer/runtime -I /home/opam/.opam/default/lib/ppx_portable/runtime -I /home/opam/.opam/default/lib/ppx_sexp_conv/runtime-lib -I /home/opam/.opam/default/lib/ppx_stable_witness/runtime -I /home/opam/.opam/default/lib/ppx_stable_witness/stable_witness -I /home/opam/.opam/default/lib/ppx_string/runtime -I /home/opam/.opam/default/lib/ppx_string_conv/runtime -I /home/opam/.opam/default/lib/ppx_typed_fields/typed_fields_lib -I /home/opam/.opam/default/lib/ppx_typed_fields/typed_variants_lib -I /home/opam/.opam/default/lib/ppxlib/print_diff -I /home/opam/.opam/default/lib/ppxlib/stdppx -I /home/opam/.opam/default/lib/ppxlib_ast/stdppx -I /home/opam/.opam/default/lib/sexp_type -I /home/opam/.opam/default/lib/sexp_type/grammar -I /home/opam/.opam/default/lib/sexplib -I /home/opam/.opam/default/lib/sexplib0 -I /home/opam/.opam/default/lib/splittable_random -I /home/opam/.opam/default/lib/stdio -I /home/opam/.opam/default/lib/stdlib-shims -I /home/opam/.opam/default/lib/time_now -I /home/opam/.opam/default/lib/typerep -I /home/opam/.opam/default/lib/unique -I /home/opam/.opam/default/lib/variantslib -I ../bindings -I ../wrapper_types -o torch_api.o -c torch_api.cpp)
- torch_api.cpp:1:10: fatal error: torch/csrc/autograd/engine.h: No such file or directory
-     1 | #include <torch/csrc/autograd/engine.h>
-       |          ^~~~~~~~~~~~~~~~~~~~~~~~~~~~~~
- compilation terminated.
- File "src/wrapper_refcounted/dune", line 4, characters 32-63:
- 4 |   (names torch_api ocaml_to_cpp torch_refcounted_api_generated0
-                                     ^^^^^^^^^^^^^^^^^^^^^^^^^^^^^^^
- (cd _build/default/src/wrapper_refcounted && /usr/bin/gcc -std=c++17 -fPIC -D_GLIBCXX_USE_CXX11_ABI=1 -g -I /home/opam/.opam/default/lib/ocaml -I /home/opam/.opam/default/lib/base -I /home/opam/.opam/default/lib/base/md5 -I /home/opam/.opam/default/lib/base/shadow_stdlib -I /home/opam/.opam/default/lib/base_bigstring -I /home/opam/.opam/default/lib/base_internalhash_types -I /home/opam/.opam/default/lib/base_quickcheck -I /home/opam/.opam/default/lib/base_quickcheck/ppx_quickcheck/runtime -I /home/opam/.opam/default/lib/basement -I /home/opam/.opam/default/lib/bin_prot -I /home/opam/.opam/default/lib/bin_prot/shape -I /home/opam/.opam/default/lib/capsule -I /home/opam/.opam/default/lib/capsule0/blocking_sync -I /home/opam/.opam/default/lib/capsule0/prim -I /home/opam/.opam/default/lib/core -I /home/opam/.opam/default/lib/core/base_for_tests -I /home/opam/.opam/default/lib/core/command -I /home/opam/.opam/default/lib/core/filename_base -I /home/opam/.opam/default/lib/core/heap_block -I /home/opam/.opam/default/lib/core/validate -I /home/opam/.opam/default/lib/fieldslib -I /home/opam/.opam/default/lib/float_array -I /home/opam/.opam/default/lib/int_repr -I /home/opam/.opam/default/lib/jane-street-headers -I /home/opam/.opam/default/lib/nonempty_list_type -I /home/opam/.opam/default/lib/ocaml/stdlib_stable -I /home/opam/.opam/default/lib/ocaml_intrinsics_kernel -I /home/opam/.opam/default/lib/parsexp -I /home/opam/.opam/default/lib/portable -I /home/opam/.opam/default/lib/portable/common -I /home/opam/.opam/default/lib/portable/kernel -I /home/opam/.opam/default/lib/ppx_assert/runtime-lib -I /home/opam/.opam/default/lib/ppx_bench/config -I /home/opam/.opam/default/lib/ppx_bench/config_types -I /home/opam/.opam/default/lib/ppx_bench/runtime-lib -I /home/opam/.opam/default/lib/ppx_box/lib -I /home/opam/.opam/default/lib/ppx_compare/runtime-lib -I /home/opam/.opam/default/lib/ppx_diff/diffable -I /home/opam/.opam/default/lib/ppx_diff/diffable_cinaps -I /home/opam/.opam/default/lib/ppx_enumerate/runtime-lib -I /home/opam/.opam/default/lib/ppx_expect/config -I /home/opam/.opam/default/lib/ppx_expect/config_types -I /home/opam/.opam/default/lib/ppx_expect/make_corrected_file -I /home/opam/.opam/default/lib/ppx_expect/make_corrected_file_kernel -I /home/opam/.opam/default/lib/ppx_expect/runtime -I /home/opam/.opam/default/lib/ppx_expect/runtime_types -I /home/opam/.opam/default/lib/ppx_fuelproof/runtime -I /home/opam/.opam/default/lib/ppx_hash/runtime-lib -I /home/opam/.opam/default/lib/ppx_here/runtime-lib -I /home/opam/.opam/default/lib/ppx_inline_test/config -I /home/opam/.opam/default/lib/ppx_inline_test/runtime-lib -I /home/opam/.opam/default/lib/ppx_log/syntax -I /home/opam/.opam/default/lib/ppx_log/types -I /home/opam/.opam/default/lib/ppx_module_timer/runtime -I /home/opam/.opam/default/lib/ppx_portable/runtime -I /home/opam/.opam/default/lib/ppx_sexp_conv/runtime-lib -I /home/opam/.opam/default/lib/ppx_stable_witness/runtime -I /home/opam/.opam/default/lib/ppx_stable_witness/stable_witness -I /home/opam/.opam/default/lib/ppx_string/runtime -I /home/opam/.opam/default/lib/ppx_string_conv/runtime -I /home/opam/.opam/default/lib/ppx_typed_fields/typed_fields_lib -I /home/opam/.opam/default/lib/ppx_typed_fields/typed_variants_lib -I /home/opam/.opam/default/lib/ppxlib/print_diff -I /home/opam/.opam/default/lib/ppxlib/stdppx -I /home/opam/.opam/default/lib/ppxlib_ast/stdppx -I /home/opam/.opam/default/lib/sexp_type -I /home/opam/.opam/default/lib/sexp_type/grammar -I /home/opam/.opam/default/lib/sexplib -I /home/opam/.opam/default/lib/sexplib0 -I /home/opam/.opam/default/lib/splittable_random -I /home/opam/.opam/default/lib/stdio -I /home/opam/.opam/default/lib/stdlib-shims -I /home/opam/.opam/default/lib/string_dict -I /home/opam/.opam/default/lib/time_now -I /home/opam/.opam/default/lib/typerep -I /home/opam/.opam/default/lib/unboxed -I /home/opam/.opam/default/lib/unboxed/bin_prot_unboxed_numbers -I /home/opam/.opam/default/lib/unboxed/float32 -I /home/opam/.opam/default/lib/unboxed/float32_u -I /home/opam/.opam/default/lib/unboxed/float_u -I /home/opam/.opam/default/lib/unboxed/int32_u -I /home/opam/.opam/default/lib/unboxed/int64_u -I /home/opam/.opam/default/lib/unboxed/nativeint_u -I /home/opam/.opam/default/lib/unboxed/packed_float_option -I /home/opam/.opam/default/lib/unboxed/percent_u -I /home/opam/.opam/default/lib/unique -I /home/opam/.opam/default/lib/univ_map -I /home/opam/.opam/default/lib/variantslib -I /home/opam/.opam/default/lib/vec -I ../bindings_refcounted -I ../local_iterators -I ../wrapper_types -o torch_refcounted_api_generated0.o -c torch_refcounted_api_generated0.cpp)
- In file included from torch_refcounted_api_generated0.cpp:2:
- torch_api_for_generated.hpp:1:10: fatal error: torch/csrc/autograd/engine.h: No such file or directory
-     1 | #include <torch/csrc/autograd/engine.h>
-       |          ^~~~~~~~~~~~~~~~~~~~~~~~~~~~~~
- compilation terminated.
- File "src/wrapper_refcounted/dune", line 5, characters 4-35:
- 5 |     torch_refcounted_api_generated1 torch_refcounted_api_generated2
-         ^^^^^^^^^^^^^^^^^^^^^^^^^^^^^^^
- (cd _build/default/src/wrapper_refcounted && /usr/bin/gcc -std=c++17 -fPIC -D_GLIBCXX_USE_CXX11_ABI=1 -g -I /home/opam/.opam/default/lib/ocaml -I /home/opam/.opam/default/lib/base -I /home/opam/.opam/default/lib/base/md5 -I /home/opam/.opam/default/lib/base/shadow_stdlib -I /home/opam/.opam/default/lib/base_bigstring -I /home/opam/.opam/default/lib/base_internalhash_types -I /home/opam/.opam/default/lib/base_quickcheck -I /home/opam/.opam/default/lib/base_quickcheck/ppx_quickcheck/runtime -I /home/opam/.opam/default/lib/basement -I /home/opam/.opam/default/lib/bin_prot -I /home/opam/.opam/default/lib/bin_prot/shape -I /home/opam/.opam/default/lib/capsule -I /home/opam/.opam/default/lib/capsule0/blocking_sync -I /home/opam/.opam/default/lib/capsule0/prim -I /home/opam/.opam/default/lib/core -I /home/opam/.opam/default/lib/core/base_for_tests -I /home/opam/.opam/default/lib/core/command -I /home/opam/.opam/default/lib/core/filename_base -I /home/opam/.opam/default/lib/core/heap_block -I /home/opam/.opam/default/lib/core/validate -I /home/opam/.opam/default/lib/fieldslib -I /home/opam/.opam/default/lib/float_array -I /home/opam/.opam/default/lib/int_repr -I /home/opam/.opam/default/lib/jane-street-headers -I /home/opam/.opam/default/lib/nonempty_list_type -I /home/opam/.opam/default/lib/ocaml/stdlib_stable -I /home/opam/.opam/default/lib/ocaml_intrinsics_kernel -I /home/opam/.opam/default/lib/parsexp -I /home/opam/.opam/default/lib/portable -I /home/opam/.opam/default/lib/portable/common -I /home/opam/.opam/default/lib/portable/kernel -I /home/opam/.opam/default/lib/ppx_assert/runtime-lib -I /home/opam/.opam/default/lib/ppx_bench/config -I /home/opam/.opam/default/lib/ppx_bench/config_types -I /home/opam/.opam/default/lib/ppx_bench/runtime-lib -I /home/opam/.opam/default/lib/ppx_box/lib -I /home/opam/.opam/default/lib/ppx_compare/runtime-lib -I /home/opam/.opam/default/lib/ppx_diff/diffable -I /home/opam/.opam/default/lib/ppx_diff/diffable_cinaps -I /home/opam/.opam/default/lib/ppx_enumerate/runtime-lib -I /home/opam/.opam/default/lib/ppx_expect/config -I /home/opam/.opam/default/lib/ppx_expect/config_types -I /home/opam/.opam/default/lib/ppx_expect/make_corrected_file -I /home/opam/.opam/default/lib/ppx_expect/make_corrected_file_kernel -I /home/opam/.opam/default/lib/ppx_expect/runtime -I /home/opam/.opam/default/lib/ppx_expect/runtime_types -I /home/opam/.opam/default/lib/ppx_fuelproof/runtime -I /home/opam/.opam/default/lib/ppx_hash/runtime-lib -I /home/opam/.opam/default/lib/ppx_here/runtime-lib -I /home/opam/.opam/default/lib/ppx_inline_test/config -I /home/opam/.opam/default/lib/ppx_inline_test/runtime-lib -I /home/opam/.opam/default/lib/ppx_log/syntax -I /home/opam/.opam/default/lib/ppx_log/types -I /home/opam/.opam/default/lib/ppx_module_timer/runtime -I /home/opam/.opam/default/lib/ppx_portable/runtime -I /home/opam/.opam/default/lib/ppx_sexp_conv/runtime-lib -I /home/opam/.opam/default/lib/ppx_stable_witness/runtime -I /home/opam/.opam/default/lib/ppx_stable_witness/stable_witness -I /home/opam/.opam/default/lib/ppx_string/runtime -I /home/opam/.opam/default/lib/ppx_string_conv/runtime -I /home/opam/.opam/default/lib/ppx_typed_fields/typed_fields_lib -I /home/opam/.opam/default/lib/ppx_typed_fields/typed_variants_lib -I /home/opam/.opam/default/lib/ppxlib/print_diff -I /home/opam/.opam/default/lib/ppxlib/stdppx -I /home/opam/.opam/default/lib/ppxlib_ast/stdppx -I /home/opam/.opam/default/lib/sexp_type -I /home/opam/.opam/default/lib/sexp_type/grammar -I /home/opam/.opam/default/lib/sexplib -I /home/opam/.opam/default/lib/sexplib0 -I /home/opam/.opam/default/lib/splittable_random -I /home/opam/.opam/default/lib/stdio -I /home/opam/.opam/default/lib/stdlib-shims -I /home/opam/.opam/default/lib/string_dict -I /home/opam/.opam/default/lib/time_now -I /home/opam/.opam/default/lib/typerep -I /home/opam/.opam/default/lib/unboxed -I /home/opam/.opam/default/lib/unboxed/bin_prot_unboxed_numbers -I /home/opam/.opam/default/lib/unboxed/float32 -I /home/opam/.opam/default/lib/unboxed/float32_u -I /home/opam/.opam/default/lib/unboxed/float_u -I /home/opam/.opam/default/lib/unboxed/int32_u -I /home/opam/.opam/default/lib/unboxed/int64_u -I /home/opam/.opam/default/lib/unboxed/nativeint_u -I /home/opam/.opam/default/lib/unboxed/packed_float_option -I /home/opam/.opam/default/lib/unboxed/percent_u -I /home/opam/.opam/default/lib/unique -I /home/opam/.opam/default/lib/univ_map -I /home/opam/.opam/default/lib/variantslib -I /home/opam/.opam/default/lib/vec -I ../bindings_refcounted -I ../local_iterators -I ../wrapper_types -o torch_refcounted_api_generated1.o -c torch_refcounted_api_generated1.cpp)
- In file included from torch_refcounted_api_generated1.cpp:2:
- torch_api_for_generated.hpp:1:10: fatal error: torch/csrc/autograd/engine.h: No such file or directory
-     1 | #include <torch/csrc/autograd/engine.h>
-       |          ^~~~~~~~~~~~~~~~~~~~~~~~~~~~~~
- compilation terminated.
- File "src/wrapper_refcounted/dune", line 6, characters 4-35:
- 6 |     torch_refcounted_api_generated3 torch_refcounted_api_generated4
-         ^^^^^^^^^^^^^^^^^^^^^^^^^^^^^^^
- (cd _build/default/src/wrapper_refcounted && /usr/bin/gcc -std=c++17 -fPIC -D_GLIBCXX_USE_CXX11_ABI=1 -g -I /home/opam/.opam/default/lib/ocaml -I /home/opam/.opam/default/lib/base -I /home/opam/.opam/default/lib/base/md5 -I /home/opam/.opam/default/lib/base/shadow_stdlib -I /home/opam/.opam/default/lib/base_bigstring -I /home/opam/.opam/default/lib/base_internalhash_types -I /home/opam/.opam/default/lib/base_quickcheck -I /home/opam/.opam/default/lib/base_quickcheck/ppx_quickcheck/runtime -I /home/opam/.opam/default/lib/basement -I /home/opam/.opam/default/lib/bin_prot -I /home/opam/.opam/default/lib/bin_prot/shape -I /home/opam/.opam/default/lib/capsule -I /home/opam/.opam/default/lib/capsule0/blocking_sync -I /home/opam/.opam/default/lib/capsule0/prim -I /home/opam/.opam/default/lib/core -I /home/opam/.opam/default/lib/core/base_for_tests -I /home/opam/.opam/default/lib/core/command -I /home/opam/.opam/default/lib/core/filename_base -I /home/opam/.opam/default/lib/core/heap_block -I /home/opam/.opam/default/lib/core/validate -I /home/opam/.opam/default/lib/fieldslib -I /home/opam/.opam/default/lib/float_array -I /home/opam/.opam/default/lib/int_repr -I /home/opam/.opam/default/lib/jane-street-headers -I /home/opam/.opam/default/lib/nonempty_list_type -I /home/opam/.opam/default/lib/ocaml/stdlib_stable -I /home/opam/.opam/default/lib/ocaml_intrinsics_kernel -I /home/opam/.opam/default/lib/parsexp -I /home/opam/.opam/default/lib/portable -I /home/opam/.opam/default/lib/portable/common -I /home/opam/.opam/default/lib/portable/kernel -I /home/opam/.opam/default/lib/ppx_assert/runtime-lib -I /home/opam/.opam/default/lib/ppx_bench/config -I /home/opam/.opam/default/lib/ppx_bench/config_types -I /home/opam/.opam/default/lib/ppx_bench/runtime-lib -I /home/opam/.opam/default/lib/ppx_box/lib -I /home/opam/.opam/default/lib/ppx_compare/runtime-lib -I /home/opam/.opam/default/lib/ppx_diff/diffable -I /home/opam/.opam/default/lib/ppx_diff/diffable_cinaps -I /home/opam/.opam/default/lib/ppx_enumerate/runtime-lib -I /home/opam/.opam/default/lib/ppx_expect/config -I /home/opam/.opam/default/lib/ppx_expect/config_types -I /home/opam/.opam/default/lib/ppx_expect/make_corrected_file -I /home/opam/.opam/default/lib/ppx_expect/make_corrected_file_kernel -I /home/opam/.opam/default/lib/ppx_expect/runtime -I /home/opam/.opam/default/lib/ppx_expect/runtime_types -I /home/opam/.opam/default/lib/ppx_fuelproof/runtime -I /home/opam/.opam/default/lib/ppx_hash/runtime-lib -I /home/opam/.opam/default/lib/ppx_here/runtime-lib -I /home/opam/.opam/default/lib/ppx_inline_test/config -I /home/opam/.opam/default/lib/ppx_inline_test/runtime-lib -I /home/opam/.opam/default/lib/ppx_log/syntax -I /home/opam/.opam/default/lib/ppx_log/types -I /home/opam/.opam/default/lib/ppx_module_timer/runtime -I /home/opam/.opam/default/lib/ppx_portable/runtime -I /home/opam/.opam/default/lib/ppx_sexp_conv/runtime-lib -I /home/opam/.opam/default/lib/ppx_stable_witness/runtime -I /home/opam/.opam/default/lib/ppx_stable_witness/stable_witness -I /home/opam/.opam/default/lib/ppx_string/runtime -I /home/opam/.opam/default/lib/ppx_string_conv/runtime -I /home/opam/.opam/default/lib/ppx_typed_fields/typed_fields_lib -I /home/opam/.opam/default/lib/ppx_typed_fields/typed_variants_lib -I /home/opam/.opam/default/lib/ppxlib/print_diff -I /home/opam/.opam/default/lib/ppxlib/stdppx -I /home/opam/.opam/default/lib/ppxlib_ast/stdppx -I /home/opam/.opam/default/lib/sexp_type -I /home/opam/.opam/default/lib/sexp_type/grammar -I /home/opam/.opam/default/lib/sexplib -I /home/opam/.opam/default/lib/sexplib0 -I /home/opam/.opam/default/lib/splittable_random -I /home/opam/.opam/default/lib/stdio -I /home/opam/.opam/default/lib/stdlib-shims -I /home/opam/.opam/default/lib/string_dict -I /home/opam/.opam/default/lib/time_now -I /home/opam/.opam/default/lib/typerep -I /home/opam/.opam/default/lib/unboxed -I /home/opam/.opam/default/lib/unboxed/bin_prot_unboxed_numbers -I /home/opam/.opam/default/lib/unboxed/float32 -I /home/opam/.opam/default/lib/unboxed/float32_u -I /home/opam/.opam/default/lib/unboxed/float_u -I /home/opam/.opam/default/lib/unboxed/int32_u -I /home/opam/.opam/default/lib/unboxed/int64_u -I /home/opam/.opam/default/lib/unboxed/nativeint_u -I /home/opam/.opam/default/lib/unboxed/packed_float_option -I /home/opam/.opam/default/lib/unboxed/percent_u -I /home/opam/.opam/default/lib/unique -I /home/opam/.opam/default/lib/univ_map -I /home/opam/.opam/default/lib/variantslib -I /home/opam/.opam/default/lib/vec -I ../bindings_refcounted -I ../local_iterators -I ../wrapper_types -o torch_refcounted_api_generated3.o -c torch_refcounted_api_generated3.cpp)
- In file included from torch_refcounted_api_generated3.cpp:2:
- torch_api_for_generated.hpp:1:10: fatal error: torch/csrc/autograd/engine.h: No such file or directory
-     1 | #include <torch/csrc/autograd/engine.h>
-       |          ^~~~~~~~~~~~~~~~~~~~~~~~~~~~~~
- compilation terminated.
- (cd _build/default/src/wrapper && /usr/bin/gcc -O2 -fno-strict-aliasing -fwrapv -pthread -fPIC -pthread -D_FILE_OFFSET_BITS=64 -Wall -fdiagnostics-color=always -Wno-discarded-qualifiers -Wno-incompatible-pointer-types -g -I /home/opam/.opam/default/lib/ocaml -I /home/opam/.opam/default/lib/base -I /home/opam/.opam/default/lib/base/md5 -I /home/opam/.opam/default/lib/base/shadow_stdlib -I /home/opam/.opam/default/lib/base_internalhash_types -I /home/opam/.opam/default/lib/base_quickcheck -I /home/opam/.opam/default/lib/base_quickcheck/ppx_quickcheck/runtime -I /home/opam/.opam/default/lib/basement -I /home/opam/.opam/default/lib/bin_prot -I /home/opam/.opam/default/lib/bin_prot/shape -I /home/opam/.opam/default/lib/capsule -I /home/opam/.opam/default/lib/capsule0/blocking_sync -I /home/opam/.opam/default/lib/capsule0/prim -I /home/opam/.opam/default/lib/ctypes -I /home/opam/.opam/default/lib/ctypes-foreign -I /home/opam/.opam/default/lib/ctypes/stubs -I /home/opam/.opam/default/lib/fieldslib -I /home/opam/.opam/default/lib/integers -I /home/opam/.opam/default/lib/jane-street-headers -I /home/opam/.opam/default/lib/nonempty_list_type -I /home/opam/.opam/default/lib/ocaml/str -I /home/opam/.opam/default/lib/ocaml/threads -I /home/opam/.opam/default/lib/ocaml/unix -I /home/opam/.opam/default/lib/ocaml_intrinsics_kernel -I /home/opam/.opam/default/lib/parsexp -I /home/opam/.opam/default/lib/portable -I /home/opam/.opam/default/lib/portable/common -I /home/opam/.opam/default/lib/portable/kernel -I /home/opam/.opam/default/lib/ppx_assert/runtime-lib -I /home/opam/.opam/default/lib/ppx_bench/config -I /home/opam/.opam/default/lib/ppx_bench/config_types -I /home/opam/.opam/default/lib/ppx_bench/runtime-lib -I /home/opam/.opam/default/lib/ppx_compare/runtime-lib -I /home/opam/.opam/default/lib/ppx_enumerate/runtime-lib -I /home/opam/.opam/default/lib/ppx_expect/config -I /home/opam/.opam/default/lib/ppx_expect/config_types -I /home/opam/.opam/default/lib/ppx_expect/make_corrected_file -I /home/opam/.opam/default/lib/ppx_expect/make_corrected_file_kernel -I /home/opam/.opam/default/lib/ppx_expect/runtime -I /home/opam/.opam/default/lib/ppx_expect/runtime_types -I /home/opam/.opam/default/lib/ppx_fuelproof/runtime -I /home/opam/.opam/default/lib/ppx_hash/runtime-lib -I /home/opam/.opam/default/lib/ppx_here/runtime-lib -I /home/opam/.opam/default/lib/ppx_inline_test/config -I /home/opam/.opam/default/lib/ppx_inline_test/runtime-lib -I /home/opam/.opam/default/lib/ppx_log/syntax -I /home/opam/.opam/default/lib/ppx_log/types -I /home/opam/.opam/default/lib/ppx_module_timer/runtime -I /home/opam/.opam/default/lib/ppx_portable/runtime -I /home/opam/.opam/default/lib/ppx_sexp_conv/runtime-lib -I /home/opam/.opam/default/lib/ppx_stable_witness/runtime -I /home/opam/.opam/default/lib/ppx_stable_witness/stable_witness -I /home/opam/.opam/default/lib/ppx_string/runtime -I /home/opam/.opam/default/lib/ppx_string_conv/runtime -I /home/opam/.opam/default/lib/ppx_typed_fields/typed_fields_lib -I /home/opam/.opam/default/lib/ppx_typed_fields/typed_variants_lib -I /home/opam/.opam/default/lib/ppxlib/print_diff -I /home/opam/.opam/default/lib/ppxlib/stdppx -I /home/opam/.opam/default/lib/ppxlib_ast/stdppx -I /home/opam/.opam/default/lib/sexp_type -I /home/opam/.opam/default/lib/sexp_type/grammar -I /home/opam/.opam/default/lib/sexplib -I /home/opam/.opam/default/lib/sexplib0 -I /home/opam/.opam/default/lib/splittable_random -I /home/opam/.opam/default/lib/stdio -I /home/opam/.opam/default/lib/stdlib-shims -I /home/opam/.opam/default/lib/time_now -I /home/opam/.opam/default/lib/typerep -I /home/opam/.opam/default/lib/unique -I /home/opam/.opam/default/lib/variantslib -I ../bindings -I ../wrapper_types -o torch_stubs.o -c torch_stubs.c)
- In file included from /home/opam/.opam/default/lib/ctypes/ctypes_primitives.h:16,
-                  from /home/opam/.opam/default/lib/ctypes/ctypes_cstubs_internals.h:13,
-                  from torch_stubs.c:2:
- /home/opam/.opam/default/lib/ctypes/ocaml_integers.h:37:9: warning: "Int8_val" redefined
-    37 | #define Int8_val(V) ((int8_t)(Int_val(V)))
-       |         ^~~~~~~~
- In file included from /home/opam/.opam/default/lib/ocaml/caml/custom.h:20,
-                  from torch_api.h:5,
-                  from torch_stubs.c:1:
- /home/opam/.opam/default/lib/ocaml/caml/mlvalues.h:154:9: note: this is the location of the previous definition
-   154 | #define Int8_val(x)  ((int8_t) Long_val(x))
-       |         ^~~~~~~~
- /home/opam/.opam/default/lib/ctypes/ocaml_integers.h:38:9: warning: "Int16_val" redefined
-    38 | #define Int16_val(V) ((int16_t)(Int_val(V)))
-       |         ^~~~~~~~~
- /home/opam/.opam/default/lib/ocaml/caml/mlvalues.h:153:9: note: this is the location of the previous definition
-   153 | #define Int16_val(x) ((int16_t) Long_val(x))
-       |         ^~~~~~~~~
- File "src/wrapper_refcounted/dune", line 4, characters 9-18:
- 4 |   (names torch_api ocaml_to_cpp torch_refcounted_api_generated0
-              ^^^^^^^^^
- (cd _build/default/src/wrapper_refcounted && /usr/bin/gcc -std=c++17 -fPIC -D_GLIBCXX_USE_CXX11_ABI=1 -g -I /home/opam/.opam/default/lib/ocaml -I /home/opam/.opam/default/lib/base -I /home/opam/.opam/default/lib/base/md5 -I /home/opam/.opam/default/lib/base/shadow_stdlib -I /home/opam/.opam/default/lib/base_bigstring -I /home/opam/.opam/default/lib/base_internalhash_types -I /home/opam/.opam/default/lib/base_quickcheck -I /home/opam/.opam/default/lib/base_quickcheck/ppx_quickcheck/runtime -I /home/opam/.opam/default/lib/basement -I /home/opam/.opam/default/lib/bin_prot -I /home/opam/.opam/default/lib/bin_prot/shape -I /home/opam/.opam/default/lib/capsule -I /home/opam/.opam/default/lib/capsule0/blocking_sync -I /home/opam/.opam/default/lib/capsule0/prim -I /home/opam/.opam/default/lib/core -I /home/opam/.opam/default/lib/core/base_for_tests -I /home/opam/.opam/default/lib/core/command -I /home/opam/.opam/default/lib/core/filename_base -I /home/opam/.opam/default/lib/core/heap_block -I /home/opam/.opam/default/lib/core/validate -I /home/opam/.opam/default/lib/fieldslib -I /home/opam/.opam/default/lib/float_array -I /home/opam/.opam/default/lib/int_repr -I /home/opam/.opam/default/lib/jane-street-headers -I /home/opam/.opam/default/lib/nonempty_list_type -I /home/opam/.opam/default/lib/ocaml/stdlib_stable -I /home/opam/.opam/default/lib/ocaml_intrinsics_kernel -I /home/opam/.opam/default/lib/parsexp -I /home/opam/.opam/default/lib/portable -I /home/opam/.opam/default/lib/portable/common -I /home/opam/.opam/default/lib/portable/kernel -I /home/opam/.opam/default/lib/ppx_assert/runtime-lib -I /home/opam/.opam/default/lib/ppx_bench/config -I /home/opam/.opam/default/lib/ppx_bench/config_types -I /home/opam/.opam/default/lib/ppx_bench/runtime-lib -I /home/opam/.opam/default/lib/ppx_box/lib -I /home/opam/.opam/default/lib/ppx_compare/runtime-lib -I /home/opam/.opam/default/lib/ppx_diff/diffable -I /home/opam/.opam/default/lib/ppx_diff/diffable_cinaps -I /home/opam/.opam/default/lib/ppx_enumerate/runtime-lib -I /home/opam/.opam/default/lib/ppx_expect/config -I /home/opam/.opam/default/lib/ppx_expect/config_types -I /home/opam/.opam/default/lib/ppx_expect/make_corrected_file -I /home/opam/.opam/default/lib/ppx_expect/make_corrected_file_kernel -I /home/opam/.opam/default/lib/ppx_expect/runtime -I /home/opam/.opam/default/lib/ppx_expect/runtime_types -I /home/opam/.opam/default/lib/ppx_fuelproof/runtime -I /home/opam/.opam/default/lib/ppx_hash/runtime-lib -I /home/opam/.opam/default/lib/ppx_here/runtime-lib -I /home/opam/.opam/default/lib/ppx_inline_test/config -I /home/opam/.opam/default/lib/ppx_inline_test/runtime-lib -I /home/opam/.opam/default/lib/ppx_log/syntax -I /home/opam/.opam/default/lib/ppx_log/types -I /home/opam/.opam/default/lib/ppx_module_timer/runtime -I /home/opam/.opam/default/lib/ppx_portable/runtime -I /home/opam/.opam/default/lib/ppx_sexp_conv/runtime-lib -I /home/opam/.opam/default/lib/ppx_stable_witness/runtime -I /home/opam/.opam/default/lib/ppx_stable_witness/stable_witness -I /home/opam/.opam/default/lib/ppx_string/runtime -I /home/opam/.opam/default/lib/ppx_string_conv/runtime -I /home/opam/.opam/default/lib/ppx_typed_fields/typed_fields_lib -I /home/opam/.opam/default/lib/ppx_typed_fields/typed_variants_lib -I /home/opam/.opam/default/lib/ppxlib/print_diff -I /home/opam/.opam/default/lib/ppxlib/stdppx -I /home/opam/.opam/default/lib/ppxlib_ast/stdppx -I /home/opam/.opam/default/lib/sexp_type -I /home/opam/.opam/default/lib/sexp_type/grammar -I /home/opam/.opam/default/lib/sexplib -I /home/opam/.opam/default/lib/sexplib0 -I /home/opam/.opam/default/lib/splittable_random -I /home/opam/.opam/default/lib/stdio -I /home/opam/.opam/default/lib/stdlib-shims -I /home/opam/.opam/default/lib/string_dict -I /home/opam/.opam/default/lib/time_now -I /home/opam/.opam/default/lib/typerep -I /home/opam/.opam/default/lib/unboxed -I /home/opam/.opam/default/lib/unboxed/bin_prot_unboxed_numbers -I /home/opam/.opam/default/lib/unboxed/float32 -I /home/opam/.opam/default/lib/unboxed/float32_u -I /home/opam/.opam/default/lib/unboxed/float_u -I /home/opam/.opam/default/lib/unboxed/int32_u -I /home/opam/.opam/default/lib/unboxed/int64_u -I /home/opam/.opam/default/lib/unboxed/nativeint_u -I /home/opam/.opam/default/lib/unboxed/packed_float_option -I /home/opam/.opam/default/lib/unboxed/percent_u -I /home/opam/.opam/default/lib/unique -I /home/opam/.opam/default/lib/univ_map -I /home/opam/.opam/default/lib/variantslib -I /home/opam/.opam/default/lib/vec -I ../bindings_refcounted -I ../local_iterators -I ../wrapper_types -o torch_api.o -c torch_api.cpp)
- torch_api.cpp:1:10: fatal error: torch/csrc/autograd/engine.h: No such file or directory
-     1 | #include <torch/csrc/autograd/engine.h>
-       |          ^~~~~~~~~~~~~~~~~~~~~~~~~~~~~~
- compilation terminated.
- File "src/wrapper_refcounted/dune", line 5, characters 36-67:
- 5 |     torch_refcounted_api_generated1 torch_refcounted_api_generated2
-                                         ^^^^^^^^^^^^^^^^^^^^^^^^^^^^^^^
- (cd _build/default/src/wrapper_refcounted && /usr/bin/gcc -std=c++17 -fPIC -D_GLIBCXX_USE_CXX11_ABI=1 -g -I /home/opam/.opam/default/lib/ocaml -I /home/opam/.opam/default/lib/base -I /home/opam/.opam/default/lib/base/md5 -I /home/opam/.opam/default/lib/base/shadow_stdlib -I /home/opam/.opam/default/lib/base_bigstring -I /home/opam/.opam/default/lib/base_internalhash_types -I /home/opam/.opam/default/lib/base_quickcheck -I /home/opam/.opam/default/lib/base_quickcheck/ppx_quickcheck/runtime -I /home/opam/.opam/default/lib/basement -I /home/opam/.opam/default/lib/bin_prot -I /home/opam/.opam/default/lib/bin_prot/shape -I /home/opam/.opam/default/lib/capsule -I /home/opam/.opam/default/lib/capsule0/blocking_sync -I /home/opam/.opam/default/lib/capsule0/prim -I /home/opam/.opam/default/lib/core -I /home/opam/.opam/default/lib/core/base_for_tests -I /home/opam/.opam/default/lib/core/command -I /home/opam/.opam/default/lib/core/filename_base -I /home/opam/.opam/default/lib/core/heap_block -I /home/opam/.opam/default/lib/core/validate -I /home/opam/.opam/default/lib/fieldslib -I /home/opam/.opam/default/lib/float_array -I /home/opam/.opam/default/lib/int_repr -I /home/opam/.opam/default/lib/jane-street-headers -I /home/opam/.opam/default/lib/nonempty_list_type -I /home/opam/.opam/default/lib/ocaml/stdlib_stable -I /home/opam/.opam/default/lib/ocaml_intrinsics_kernel -I /home/opam/.opam/default/lib/parsexp -I /home/opam/.opam/default/lib/portable -I /home/opam/.opam/default/lib/portable/common -I /home/opam/.opam/default/lib/portable/kernel -I /home/opam/.opam/default/lib/ppx_assert/runtime-lib -I /home/opam/.opam/default/lib/ppx_bench/config -I /home/opam/.opam/default/lib/ppx_bench/config_types -I /home/opam/.opam/default/lib/ppx_bench/runtime-lib -I /home/opam/.opam/default/lib/ppx_box/lib -I /home/opam/.opam/default/lib/ppx_compare/runtime-lib -I /home/opam/.opam/default/lib/ppx_diff/diffable -I /home/opam/.opam/default/lib/ppx_diff/diffable_cinaps -I /home/opam/.opam/default/lib/ppx_enumerate/runtime-lib -I /home/opam/.opam/default/lib/ppx_expect/config -I /home/opam/.opam/default/lib/ppx_expect/config_types -I /home/opam/.opam/default/lib/ppx_expect/make_corrected_file -I /home/opam/.opam/default/lib/ppx_expect/make_corrected_file_kernel -I /home/opam/.opam/default/lib/ppx_expect/runtime -I /home/opam/.opam/default/lib/ppx_expect/runtime_types -I /home/opam/.opam/default/lib/ppx_fuelproof/runtime -I /home/opam/.opam/default/lib/ppx_hash/runtime-lib -I /home/opam/.opam/default/lib/ppx_here/runtime-lib -I /home/opam/.opam/default/lib/ppx_inline_test/config -I /home/opam/.opam/default/lib/ppx_inline_test/runtime-lib -I /home/opam/.opam/default/lib/ppx_log/syntax -I /home/opam/.opam/default/lib/ppx_log/types -I /home/opam/.opam/default/lib/ppx_module_timer/runtime -I /home/opam/.opam/default/lib/ppx_portable/runtime -I /home/opam/.opam/default/lib/ppx_sexp_conv/runtime-lib -I /home/opam/.opam/default/lib/ppx_stable_witness/runtime -I /home/opam/.opam/default/lib/ppx_stable_witness/stable_witness -I /home/opam/.opam/default/lib/ppx_string/runtime -I /home/opam/.opam/default/lib/ppx_string_conv/runtime -I /home/opam/.opam/default/lib/ppx_typed_fields/typed_fields_lib -I /home/opam/.opam/default/lib/ppx_typed_fields/typed_variants_lib -I /home/opam/.opam/default/lib/ppxlib/print_diff -I /home/opam/.opam/default/lib/ppxlib/stdppx -I /home/opam/.opam/default/lib/ppxlib_ast/stdppx -I /home/opam/.opam/default/lib/sexp_type -I /home/opam/.opam/default/lib/sexp_type/grammar -I /home/opam/.opam/default/lib/sexplib -I /home/opam/.opam/default/lib/sexplib0 -I /home/opam/.opam/default/lib/splittable_random -I /home/opam/.opam/default/lib/stdio -I /home/opam/.opam/default/lib/stdlib-shims -I /home/opam/.opam/default/lib/string_dict -I /home/opam/.opam/default/lib/time_now -I /home/opam/.opam/default/lib/typerep -I /home/opam/.opam/default/lib/unboxed -I /home/opam/.opam/default/lib/unboxed/bin_prot_unboxed_numbers -I /home/opam/.opam/default/lib/unboxed/float32 -I /home/opam/.opam/default/lib/unboxed/float32_u -I /home/opam/.opam/default/lib/unboxed/float_u -I /home/opam/.opam/default/lib/unboxed/int32_u -I /home/opam/.opam/default/lib/unboxed/int64_u -I /home/opam/.opam/default/lib/unboxed/nativeint_u -I /home/opam/.opam/default/lib/unboxed/packed_float_option -I /home/opam/.opam/default/lib/unboxed/percent_u -I /home/opam/.opam/default/lib/unique -I /home/opam/.opam/default/lib/univ_map -I /home/opam/.opam/default/lib/variantslib -I /home/opam/.opam/default/lib/vec -I ../bindings_refcounted -I ../local_iterators -I ../wrapper_types -o torch_refcounted_api_generated2.o -c torch_refcounted_api_generated2.cpp)
- In file included from torch_refcounted_api_generated2.cpp:2:
- torch_api_for_generated.hpp:1:10: fatal error: torch/csrc/autograd/engine.h: No such file or directory
-     1 | #include <torch/csrc/autograd/engine.h>
-       |          ^~~~~~~~~~~~~~~~~~~~~~~~~~~~~~
- compilation terminated.
- File "src/wrapper_refcounted/dune", line 6, characters 36-67:
- 6 |     torch_refcounted_api_generated3 torch_refcounted_api_generated4
-                                         ^^^^^^^^^^^^^^^^^^^^^^^^^^^^^^^
- (cd _build/default/src/wrapper_refcounted && /usr/bin/gcc -std=c++17 -fPIC -D_GLIBCXX_USE_CXX11_ABI=1 -g -I /home/opam/.opam/default/lib/ocaml -I /home/opam/.opam/default/lib/base -I /home/opam/.opam/default/lib/base/md5 -I /home/opam/.opam/default/lib/base/shadow_stdlib -I /home/opam/.opam/default/lib/base_bigstring -I /home/opam/.opam/default/lib/base_internalhash_types -I /home/opam/.opam/default/lib/base_quickcheck -I /home/opam/.opam/default/lib/base_quickcheck/ppx_quickcheck/runtime -I /home/opam/.opam/default/lib/basement -I /home/opam/.opam/default/lib/bin_prot -I /home/opam/.opam/default/lib/bin_prot/shape -I /home/opam/.opam/default/lib/capsule -I /home/opam/.opam/default/lib/capsule0/blocking_sync -I /home/opam/.opam/default/lib/capsule0/prim -I /home/opam/.opam/default/lib/core -I /home/opam/.opam/default/lib/core/base_for_tests -I /home/opam/.opam/default/lib/core/command -I /home/opam/.opam/default/lib/core/filename_base -I /home/opam/.opam/default/lib/core/heap_block -I /home/opam/.opam/default/lib/core/validate -I /home/opam/.opam/default/lib/fieldslib -I /home/opam/.opam/default/lib/float_array -I /home/opam/.opam/default/lib/int_repr -I /home/opam/.opam/default/lib/jane-street-headers -I /home/opam/.opam/default/lib/nonempty_list_type -I /home/opam/.opam/default/lib/ocaml/stdlib_stable -I /home/opam/.opam/default/lib/ocaml_intrinsics_kernel -I /home/opam/.opam/default/lib/parsexp -I /home/opam/.opam/default/lib/portable -I /home/opam/.opam/default/lib/portable/common -I /home/opam/.opam/default/lib/portable/kernel -I /home/opam/.opam/default/lib/ppx_assert/runtime-lib -I /home/opam/.opam/default/lib/ppx_bench/config -I /home/opam/.opam/default/lib/ppx_bench/config_types -I /home/opam/.opam/default/lib/ppx_bench/runtime-lib -I /home/opam/.opam/default/lib/ppx_box/lib -I /home/opam/.opam/default/lib/ppx_compare/runtime-lib -I /home/opam/.opam/default/lib/ppx_diff/diffable -I /home/opam/.opam/default/lib/ppx_diff/diffable_cinaps -I /home/opam/.opam/default/lib/ppx_enumerate/runtime-lib -I /home/opam/.opam/default/lib/ppx_expect/config -I /home/opam/.opam/default/lib/ppx_expect/config_types -I /home/opam/.opam/default/lib/ppx_expect/make_corrected_file -I /home/opam/.opam/default/lib/ppx_expect/make_corrected_file_kernel -I /home/opam/.opam/default/lib/ppx_expect/runtime -I /home/opam/.opam/default/lib/ppx_expect/runtime_types -I /home/opam/.opam/default/lib/ppx_fuelproof/runtime -I /home/opam/.opam/default/lib/ppx_hash/runtime-lib -I /home/opam/.opam/default/lib/ppx_here/runtime-lib -I /home/opam/.opam/default/lib/ppx_inline_test/config -I /home/opam/.opam/default/lib/ppx_inline_test/runtime-lib -I /home/opam/.opam/default/lib/ppx_log/syntax -I /home/opam/.opam/default/lib/ppx_log/types -I /home/opam/.opam/default/lib/ppx_module_timer/runtime -I /home/opam/.opam/default/lib/ppx_portable/runtime -I /home/opam/.opam/default/lib/ppx_sexp_conv/runtime-lib -I /home/opam/.opam/default/lib/ppx_stable_witness/runtime -I /home/opam/.opam/default/lib/ppx_stable_witness/stable_witness -I /home/opam/.opam/default/lib/ppx_string/runtime -I /home/opam/.opam/default/lib/ppx_string_conv/runtime -I /home/opam/.opam/default/lib/ppx_typed_fields/typed_fields_lib -I /home/opam/.opam/default/lib/ppx_typed_fields/typed_variants_lib -I /home/opam/.opam/default/lib/ppxlib/print_diff -I /home/opam/.opam/default/lib/ppxlib/stdppx -I /home/opam/.opam/default/lib/ppxlib_ast/stdppx -I /home/opam/.opam/default/lib/sexp_type -I /home/opam/.opam/default/lib/sexp_type/grammar -I /home/opam/.opam/default/lib/sexplib -I /home/opam/.opam/default/lib/sexplib0 -I /home/opam/.opam/default/lib/splittable_random -I /home/opam/.opam/default/lib/stdio -I /home/opam/.opam/default/lib/stdlib-shims -I /home/opam/.opam/default/lib/string_dict -I /home/opam/.opam/default/lib/time_now -I /home/opam/.opam/default/lib/typerep -I /home/opam/.opam/default/lib/unboxed -I /home/opam/.opam/default/lib/unboxed/bin_prot_unboxed_numbers -I /home/opam/.opam/default/lib/unboxed/float32 -I /home/opam/.opam/default/lib/unboxed/float32_u -I /home/opam/.opam/default/lib/unboxed/float_u -I /home/opam/.opam/default/lib/unboxed/int32_u -I /home/opam/.opam/default/lib/unboxed/int64_u -I /home/opam/.opam/default/lib/unboxed/nativeint_u -I /home/opam/.opam/default/lib/unboxed/packed_float_option -I /home/opam/.opam/default/lib/unboxed/percent_u -I /home/opam/.opam/default/lib/unique -I /home/opam/.opam/default/lib/univ_map -I /home/opam/.opam/default/lib/variantslib -I /home/opam/.opam/default/lib/vec -I ../bindings_refcounted -I ../local_iterators -I ../wrapper_types -o torch_refcounted_api_generated4.o -c torch_refcounted_api_generated4.cpp)
- In file included from torch_refcounted_api_generated4.cpp:2:
- torch_api_for_generated.hpp:1:10: fatal error: torch/csrc/autograd/engine.h: No such file or directory
-     1 | #include <torch/csrc/autograd/engine.h>
-       |          ^~~~~~~~~~~~~~~~~~~~~~~~~~~~~~
- compilation terminated.
- File "src/wrapper_refcounted/dune", line 7, characters 4-35:
- 7 |     torch_refcounted_api_generated5 torch_refcounted_api_generated6
-         ^^^^^^^^^^^^^^^^^^^^^^^^^^^^^^^
- (cd _build/default/src/wrapper_refcounted && /usr/bin/gcc -std=c++17 -fPIC -D_GLIBCXX_USE_CXX11_ABI=1 -g -I /home/opam/.opam/default/lib/ocaml -I /home/opam/.opam/default/lib/base -I /home/opam/.opam/default/lib/base/md5 -I /home/opam/.opam/default/lib/base/shadow_stdlib -I /home/opam/.opam/default/lib/base_bigstring -I /home/opam/.opam/default/lib/base_internalhash_types -I /home/opam/.opam/default/lib/base_quickcheck -I /home/opam/.opam/default/lib/base_quickcheck/ppx_quickcheck/runtime -I /home/opam/.opam/default/lib/basement -I /home/opam/.opam/default/lib/bin_prot -I /home/opam/.opam/default/lib/bin_prot/shape -I /home/opam/.opam/default/lib/capsule -I /home/opam/.opam/default/lib/capsule0/blocking_sync -I /home/opam/.opam/default/lib/capsule0/prim -I /home/opam/.opam/default/lib/core -I /home/opam/.opam/default/lib/core/base_for_tests -I /home/opam/.opam/default/lib/core/command -I /home/opam/.opam/default/lib/core/filename_base -I /home/opam/.opam/default/lib/core/heap_block -I /home/opam/.opam/default/lib/core/validate -I /home/opam/.opam/default/lib/fieldslib -I /home/opam/.opam/default/lib/float_array -I /home/opam/.opam/default/lib/int_repr -I /home/opam/.opam/default/lib/jane-street-headers -I /home/opam/.opam/default/lib/nonempty_list_type -I /home/opam/.opam/default/lib/ocaml/stdlib_stable -I /home/opam/.opam/default/lib/ocaml_intrinsics_kernel -I /home/opam/.opam/default/lib/parsexp -I /home/opam/.opam/default/lib/portable -I /home/opam/.opam/default/lib/portable/common -I /home/opam/.opam/default/lib/portable/kernel -I /home/opam/.opam/default/lib/ppx_assert/runtime-lib -I /home/opam/.opam/default/lib/ppx_bench/config -I /home/opam/.opam/default/lib/ppx_bench/config_types -I /home/opam/.opam/default/lib/ppx_bench/runtime-lib -I /home/opam/.opam/default/lib/ppx_box/lib -I /home/opam/.opam/default/lib/ppx_compare/runtime-lib -I /home/opam/.opam/default/lib/ppx_diff/diffable -I /home/opam/.opam/default/lib/ppx_diff/diffable_cinaps -I /home/opam/.opam/default/lib/ppx_enumerate/runtime-lib -I /home/opam/.opam/default/lib/ppx_expect/config -I /home/opam/.opam/default/lib/ppx_expect/config_types -I /home/opam/.opam/default/lib/ppx_expect/make_corrected_file -I /home/opam/.opam/default/lib/ppx_expect/make_corrected_file_kernel -I /home/opam/.opam/default/lib/ppx_expect/runtime -I /home/opam/.opam/default/lib/ppx_expect/runtime_types -I /home/opam/.opam/default/lib/ppx_fuelproof/runtime -I /home/opam/.opam/default/lib/ppx_hash/runtime-lib -I /home/opam/.opam/default/lib/ppx_here/runtime-lib -I /home/opam/.opam/default/lib/ppx_inline_test/config -I /home/opam/.opam/default/lib/ppx_inline_test/runtime-lib -I /home/opam/.opam/default/lib/ppx_log/syntax -I /home/opam/.opam/default/lib/ppx_log/types -I /home/opam/.opam/default/lib/ppx_module_timer/runtime -I /home/opam/.opam/default/lib/ppx_portable/runtime -I /home/opam/.opam/default/lib/ppx_sexp_conv/runtime-lib -I /home/opam/.opam/default/lib/ppx_stable_witness/runtime -I /home/opam/.opam/default/lib/ppx_stable_witness/stable_witness -I /home/opam/.opam/default/lib/ppx_string/runtime -I /home/opam/.opam/default/lib/ppx_string_conv/runtime -I /home/opam/.opam/default/lib/ppx_typed_fields/typed_fields_lib -I /home/opam/.opam/default/lib/ppx_typed_fields/typed_variants_lib -I /home/opam/.opam/default/lib/ppxlib/print_diff -I /home/opam/.opam/default/lib/ppxlib/stdppx -I /home/opam/.opam/default/lib/ppxlib_ast/stdppx -I /home/opam/.opam/default/lib/sexp_type -I /home/opam/.opam/default/lib/sexp_type/grammar -I /home/opam/.opam/default/lib/sexplib -I /home/opam/.opam/default/lib/sexplib0 -I /home/opam/.opam/default/lib/splittable_random -I /home/opam/.opam/default/lib/stdio -I /home/opam/.opam/default/lib/stdlib-shims -I /home/opam/.opam/default/lib/string_dict -I /home/opam/.opam/default/lib/time_now -I /home/opam/.opam/default/lib/typerep -I /home/opam/.opam/default/lib/unboxed -I /home/opam/.opam/default/lib/unboxed/bin_prot_unboxed_numbers -I /home/opam/.opam/default/lib/unboxed/float32 -I /home/opam/.opam/default/lib/unboxed/float32_u -I /home/opam/.opam/default/lib/unboxed/float_u -I /home/opam/.opam/default/lib/unboxed/int32_u -I /home/opam/.opam/default/lib/unboxed/int64_u -I /home/opam/.opam/default/lib/unboxed/nativeint_u -I /home/opam/.opam/default/lib/unboxed/packed_float_option -I /home/opam/.opam/default/lib/unboxed/percent_u -I /home/opam/.opam/default/lib/unique -I /home/opam/.opam/default/lib/univ_map -I /home/opam/.opam/default/lib/variantslib -I /home/opam/.opam/default/lib/vec -I ../bindings_refcounted -I ../local_iterators -I ../wrapper_types -o torch_refcounted_api_generated5.o -c torch_refcounted_api_generated5.cpp)
- In file included from torch_refcounted_api_generated5.cpp:2:
- torch_api_for_generated.hpp:1:10: fatal error: torch/csrc/autograd/engine.h: No such file or directory
-     1 | #include <torch/csrc/autograd/engine.h>
-       |          ^~~~~~~~~~~~~~~~~~~~~~~~~~~~~~
- compilation terminated.
- File "src/wrapper_refcounted/dune", line 7, characters 36-67:
- 7 |     torch_refcounted_api_generated5 torch_refcounted_api_generated6
-                                         ^^^^^^^^^^^^^^^^^^^^^^^^^^^^^^^
- (cd _build/default/src/wrapper_refcounted && /usr/bin/gcc -std=c++17 -fPIC -D_GLIBCXX_USE_CXX11_ABI=1 -g -I /home/opam/.opam/default/lib/ocaml -I /home/opam/.opam/default/lib/base -I /home/opam/.opam/default/lib/base/md5 -I /home/opam/.opam/default/lib/base/shadow_stdlib -I /home/opam/.opam/default/lib/base_bigstring -I /home/opam/.opam/default/lib/base_internalhash_types -I /home/opam/.opam/default/lib/base_quickcheck -I /home/opam/.opam/default/lib/base_quickcheck/ppx_quickcheck/runtime -I /home/opam/.opam/default/lib/basement -I /home/opam/.opam/default/lib/bin_prot -I /home/opam/.opam/default/lib/bin_prot/shape -I /home/opam/.opam/default/lib/capsule -I /home/opam/.opam/default/lib/capsule0/blocking_sync -I /home/opam/.opam/default/lib/capsule0/prim -I /home/opam/.opam/default/lib/core -I /home/opam/.opam/default/lib/core/base_for_tests -I /home/opam/.opam/default/lib/core/command -I /home/opam/.opam/default/lib/core/filename_base -I /home/opam/.opam/default/lib/core/heap_block -I /home/opam/.opam/default/lib/core/validate -I /home/opam/.opam/default/lib/fieldslib -I /home/opam/.opam/default/lib/float_array -I /home/opam/.opam/default/lib/int_repr -I /home/opam/.opam/default/lib/jane-street-headers -I /home/opam/.opam/default/lib/nonempty_list_type -I /home/opam/.opam/default/lib/ocaml/stdlib_stable -I /home/opam/.opam/default/lib/ocaml_intrinsics_kernel -I /home/opam/.opam/default/lib/parsexp -I /home/opam/.opam/default/lib/portable -I /home/opam/.opam/default/lib/portable/common -I /home/opam/.opam/default/lib/portable/kernel -I /home/opam/.opam/default/lib/ppx_assert/runtime-lib -I /home/opam/.opam/default/lib/ppx_bench/config -I /home/opam/.opam/default/lib/ppx_bench/config_types -I /home/opam/.opam/default/lib/ppx_bench/runtime-lib -I /home/opam/.opam/default/lib/ppx_box/lib -I /home/opam/.opam/default/lib/ppx_compare/runtime-lib -I /home/opam/.opam/default/lib/ppx_diff/diffable -I /home/opam/.opam/default/lib/ppx_diff/diffable_cinaps -I /home/opam/.opam/default/lib/ppx_enumerate/runtime-lib -I /home/opam/.opam/default/lib/ppx_expect/config -I /home/opam/.opam/default/lib/ppx_expect/config_types -I /home/opam/.opam/default/lib/ppx_expect/make_corrected_file -I /home/opam/.opam/default/lib/ppx_expect/make_corrected_file_kernel -I /home/opam/.opam/default/lib/ppx_expect/runtime -I /home/opam/.opam/default/lib/ppx_expect/runtime_types -I /home/opam/.opam/default/lib/ppx_fuelproof/runtime -I /home/opam/.opam/default/lib/ppx_hash/runtime-lib -I /home/opam/.opam/default/lib/ppx_here/runtime-lib -I /home/opam/.opam/default/lib/ppx_inline_test/config -I /home/opam/.opam/default/lib/ppx_inline_test/runtime-lib -I /home/opam/.opam/default/lib/ppx_log/syntax -I /home/opam/.opam/default/lib/ppx_log/types -I /home/opam/.opam/default/lib/ppx_module_timer/runtime -I /home/opam/.opam/default/lib/ppx_portable/runtime -I /home/opam/.opam/default/lib/ppx_sexp_conv/runtime-lib -I /home/opam/.opam/default/lib/ppx_stable_witness/runtime -I /home/opam/.opam/default/lib/ppx_stable_witness/stable_witness -I /home/opam/.opam/default/lib/ppx_string/runtime -I /home/opam/.opam/default/lib/ppx_string_conv/runtime -I /home/opam/.opam/default/lib/ppx_typed_fields/typed_fields_lib -I /home/opam/.opam/default/lib/ppx_typed_fields/typed_variants_lib -I /home/opam/.opam/default/lib/ppxlib/print_diff -I /home/opam/.opam/default/lib/ppxlib/stdppx -I /home/opam/.opam/default/lib/ppxlib_ast/stdppx -I /home/opam/.opam/default/lib/sexp_type -I /home/opam/.opam/default/lib/sexp_type/grammar -I /home/opam/.opam/default/lib/sexplib -I /home/opam/.opam/default/lib/sexplib0 -I /home/opam/.opam/default/lib/splittable_random -I /home/opam/.opam/default/lib/stdio -I /home/opam/.opam/default/lib/stdlib-shims -I /home/opam/.opam/default/lib/string_dict -I /home/opam/.opam/default/lib/time_now -I /home/opam/.opam/default/lib/typerep -I /home/opam/.opam/default/lib/unboxed -I /home/opam/.opam/default/lib/unboxed/bin_prot_unboxed_numbers -I /home/opam/.opam/default/lib/unboxed/float32 -I /home/opam/.opam/default/lib/unboxed/float32_u -I /home/opam/.opam/default/lib/unboxed/float_u -I /home/opam/.opam/default/lib/unboxed/int32_u -I /home/opam/.opam/default/lib/unboxed/int64_u -I /home/opam/.opam/default/lib/unboxed/nativeint_u -I /home/opam/.opam/default/lib/unboxed/packed_float_option -I /home/opam/.opam/default/lib/unboxed/percent_u -I /home/opam/.opam/default/lib/unique -I /home/opam/.opam/default/lib/univ_map -I /home/opam/.opam/default/lib/variantslib -I /home/opam/.opam/default/lib/vec -I ../bindings_refcounted -I ../local_iterators -I ../wrapper_types -o torch_refcounted_api_generated6.o -c torch_refcounted_api_generated6.cpp)
- In file included from torch_refcounted_api_generated6.cpp:2:
- torch_api_for_generated.hpp:1:10: fatal error: torch/csrc/autograd/engine.h: No such file or directory
-     1 | #include <torch/csrc/autograd/engine.h>
-       |          ^~~~~~~~~~~~~~~~~~~~~~~~~~~~~~
- compilation terminated.
- File "src/wrapper_refcounted/dune", line 8, characters 4-35:
- 8 |     torch_refcounted_api_generated7)
-         ^^^^^^^^^^^^^^^^^^^^^^^^^^^^^^^
- (cd _build/default/src/wrapper_refcounted && /usr/bin/gcc -std=c++17 -fPIC -D_GLIBCXX_USE_CXX11_ABI=1 -g -I /home/opam/.opam/default/lib/ocaml -I /home/opam/.opam/default/lib/base -I /home/opam/.opam/default/lib/base/md5 -I /home/opam/.opam/default/lib/base/shadow_stdlib -I /home/opam/.opam/default/lib/base_bigstring -I /home/opam/.opam/default/lib/base_internalhash_types -I /home/opam/.opam/default/lib/base_quickcheck -I /home/opam/.opam/default/lib/base_quickcheck/ppx_quickcheck/runtime -I /home/opam/.opam/default/lib/basement -I /home/opam/.opam/default/lib/bin_prot -I /home/opam/.opam/default/lib/bin_prot/shape -I /home/opam/.opam/default/lib/capsule -I /home/opam/.opam/default/lib/capsule0/blocking_sync -I /home/opam/.opam/default/lib/capsule0/prim -I /home/opam/.opam/default/lib/core -I /home/opam/.opam/default/lib/core/base_for_tests -I /home/opam/.opam/default/lib/core/command -I /home/opam/.opam/default/lib/core/filename_base -I /home/opam/.opam/default/lib/core/heap_block -I /home/opam/.opam/default/lib/core/validate -I /home/opam/.opam/default/lib/fieldslib -I /home/opam/.opam/default/lib/float_array -I /home/opam/.opam/default/lib/int_repr -I /home/opam/.opam/default/lib/jane-street-headers -I /home/opam/.opam/default/lib/nonempty_list_type -I /home/opam/.opam/default/lib/ocaml/stdlib_stable -I /home/opam/.opam/default/lib/ocaml_intrinsics_kernel -I /home/opam/.opam/default/lib/parsexp -I /home/opam/.opam/default/lib/portable -I /home/opam/.opam/default/lib/portable/common -I /home/opam/.opam/default/lib/portable/kernel -I /home/opam/.opam/default/lib/ppx_assert/runtime-lib -I /home/opam/.opam/default/lib/ppx_bench/config -I /home/opam/.opam/default/lib/ppx_bench/config_types -I /home/opam/.opam/default/lib/ppx_bench/runtime-lib -I /home/opam/.opam/default/lib/ppx_box/lib -I /home/opam/.opam/default/lib/ppx_compare/runtime-lib -I /home/opam/.opam/default/lib/ppx_diff/diffable -I /home/opam/.opam/default/lib/ppx_diff/diffable_cinaps -I /home/opam/.opam/default/lib/ppx_enumerate/runtime-lib -I /home/opam/.opam/default/lib/ppx_expect/config -I /home/opam/.opam/default/lib/ppx_expect/config_types -I /home/opam/.opam/default/lib/ppx_expect/make_corrected_file -I /home/opam/.opam/default/lib/ppx_expect/make_corrected_file_kernel -I /home/opam/.opam/default/lib/ppx_expect/runtime -I /home/opam/.opam/default/lib/ppx_expect/runtime_types -I /home/opam/.opam/default/lib/ppx_fuelproof/runtime -I /home/opam/.opam/default/lib/ppx_hash/runtime-lib -I /home/opam/.opam/default/lib/ppx_here/runtime-lib -I /home/opam/.opam/default/lib/ppx_inline_test/config -I /home/opam/.opam/default/lib/ppx_inline_test/runtime-lib -I /home/opam/.opam/default/lib/ppx_log/syntax -I /home/opam/.opam/default/lib/ppx_log/types -I /home/opam/.opam/default/lib/ppx_module_timer/runtime -I /home/opam/.opam/default/lib/ppx_portable/runtime -I /home/opam/.opam/default/lib/ppx_sexp_conv/runtime-lib -I /home/opam/.opam/default/lib/ppx_stable_witness/runtime -I /home/opam/.opam/default/lib/ppx_stable_witness/stable_witness -I /home/opam/.opam/default/lib/ppx_string/runtime -I /home/opam/.opam/default/lib/ppx_string_conv/runtime -I /home/opam/.opam/default/lib/ppx_typed_fields/typed_fields_lib -I /home/opam/.opam/default/lib/ppx_typed_fields/typed_variants_lib -I /home/opam/.opam/default/lib/ppxlib/print_diff -I /home/opam/.opam/default/lib/ppxlib/stdppx -I /home/opam/.opam/default/lib/ppxlib_ast/stdppx -I /home/opam/.opam/default/lib/sexp_type -I /home/opam/.opam/default/lib/sexp_type/grammar -I /home/opam/.opam/default/lib/sexplib -I /home/opam/.opam/default/lib/sexplib0 -I /home/opam/.opam/default/lib/splittable_random -I /home/opam/.opam/default/lib/stdio -I /home/opam/.opam/default/lib/stdlib-shims -I /home/opam/.opam/default/lib/string_dict -I /home/opam/.opam/default/lib/time_now -I /home/opam/.opam/default/lib/typerep -I /home/opam/.opam/default/lib/unboxed -I /home/opam/.opam/default/lib/unboxed/bin_prot_unboxed_numbers -I /home/opam/.opam/default/lib/unboxed/float32 -I /home/opam/.opam/default/lib/unboxed/float32_u -I /home/opam/.opam/default/lib/unboxed/float_u -I /home/opam/.opam/default/lib/unboxed/int32_u -I /home/opam/.opam/default/lib/unboxed/int64_u -I /home/opam/.opam/default/lib/unboxed/nativeint_u -I /home/opam/.opam/default/lib/unboxed/packed_float_option -I /home/opam/.opam/default/lib/unboxed/percent_u -I /home/opam/.opam/default/lib/unique -I /home/opam/.opam/default/lib/univ_map -I /home/opam/.opam/default/lib/variantslib -I /home/opam/.opam/default/lib/vec -I ../bindings_refcounted -I ../local_iterators -I ../wrapper_types -o torch_refcounted_api_generated7.o -c torch_refcounted_api_generated7.cpp)
- In file included from torch_refcounted_api_generated7.cpp:2:
- torch_api_for_generated.hpp:1:10: fatal error: torch/csrc/autograd/engine.h: No such file or directory
-     1 | #include <torch/csrc/autograd/engine.h>
-       |          ^~~~~~~~~~~~~~~~~~~~~~~~~~~~~~
- compilation terminated.
- File "src/wrapper_refcounted/dune", line 4, characters 19-31:
- 4 |   (names torch_api ocaml_to_cpp torch_refcounted_api_generated0
-                        ^^^^^^^^^^^^
- (cd _build/default/src/wrapper_refcounted && /usr/bin/gcc -std=c++17 -fPIC -D_GLIBCXX_USE_CXX11_ABI=1 -g -I /home/opam/.opam/default/lib/ocaml -I /home/opam/.opam/default/lib/base -I /home/opam/.opam/default/lib/base/md5 -I /home/opam/.opam/default/lib/base/shadow_stdlib -I /home/opam/.opam/default/lib/base_bigstring -I /home/opam/.opam/default/lib/base_internalhash_types -I /home/opam/.opam/default/lib/base_quickcheck -I /home/opam/.opam/default/lib/base_quickcheck/ppx_quickcheck/runtime -I /home/opam/.opam/default/lib/basement -I /home/opam/.opam/default/lib/bin_prot -I /home/opam/.opam/default/lib/bin_prot/shape -I /home/opam/.opam/default/lib/capsule -I /home/opam/.opam/default/lib/capsule0/blocking_sync -I /home/opam/.opam/default/lib/capsule0/prim -I /home/opam/.opam/default/lib/core -I /home/opam/.opam/default/lib/core/base_for_tests -I /home/opam/.opam/default/lib/core/command -I /home/opam/.opam/default/lib/core/filename_base -I /home/opam/.opam/default/lib/core/heap_block -I /home/opam/.opam/default/lib/core/validate -I /home/opam/.opam/default/lib/fieldslib -I /home/opam/.opam/default/lib/float_array -I /home/opam/.opam/default/lib/int_repr -I /home/opam/.opam/default/lib/jane-street-headers -I /home/opam/.opam/default/lib/nonempty_list_type -I /home/opam/.opam/default/lib/ocaml/stdlib_stable -I /home/opam/.opam/default/lib/ocaml_intrinsics_kernel -I /home/opam/.opam/default/lib/parsexp -I /home/opam/.opam/default/lib/portable -I /home/opam/.opam/default/lib/portable/common -I /home/opam/.opam/default/lib/portable/kernel -I /home/opam/.opam/default/lib/ppx_assert/runtime-lib -I /home/opam/.opam/default/lib/ppx_bench/config -I /home/opam/.opam/default/lib/ppx_bench/config_types -I /home/opam/.opam/default/lib/ppx_bench/runtime-lib -I /home/opam/.opam/default/lib/ppx_box/lib -I /home/opam/.opam/default/lib/ppx_compare/runtime-lib -I /home/opam/.opam/default/lib/ppx_diff/diffable -I /home/opam/.opam/default/lib/ppx_diff/diffable_cinaps -I /home/opam/.opam/default/lib/ppx_enumerate/runtime-lib -I /home/opam/.opam/default/lib/ppx_expect/config -I /home/opam/.opam/default/lib/ppx_expect/config_types -I /home/opam/.opam/default/lib/ppx_expect/make_corrected_file -I /home/opam/.opam/default/lib/ppx_expect/make_corrected_file_kernel -I /home/opam/.opam/default/lib/ppx_expect/runtime -I /home/opam/.opam/default/lib/ppx_expect/runtime_types -I /home/opam/.opam/default/lib/ppx_fuelproof/runtime -I /home/opam/.opam/default/lib/ppx_hash/runtime-lib -I /home/opam/.opam/default/lib/ppx_here/runtime-lib -I /home/opam/.opam/default/lib/ppx_inline_test/config -I /home/opam/.opam/default/lib/ppx_inline_test/runtime-lib -I /home/opam/.opam/default/lib/ppx_log/syntax -I /home/opam/.opam/default/lib/ppx_log/types -I /home/opam/.opam/default/lib/ppx_module_timer/runtime -I /home/opam/.opam/default/lib/ppx_portable/runtime -I /home/opam/.opam/default/lib/ppx_sexp_conv/runtime-lib -I /home/opam/.opam/default/lib/ppx_stable_witness/runtime -I /home/opam/.opam/default/lib/ppx_stable_witness/stable_witness -I /home/opam/.opam/default/lib/ppx_string/runtime -I /home/opam/.opam/default/lib/ppx_string_conv/runtime -I /home/opam/.opam/default/lib/ppx_typed_fields/typed_fields_lib -I /home/opam/.opam/default/lib/ppx_typed_fields/typed_variants_lib -I /home/opam/.opam/default/lib/ppxlib/print_diff -I /home/opam/.opam/default/lib/ppxlib/stdppx -I /home/opam/.opam/default/lib/ppxlib_ast/stdppx -I /home/opam/.opam/default/lib/sexp_type -I /home/opam/.opam/default/lib/sexp_type/grammar -I /home/opam/.opam/default/lib/sexplib -I /home/opam/.opam/default/lib/sexplib0 -I /home/opam/.opam/default/lib/splittable_random -I /home/opam/.opam/default/lib/stdio -I /home/opam/.opam/default/lib/stdlib-shims -I /home/opam/.opam/default/lib/string_dict -I /home/opam/.opam/default/lib/time_now -I /home/opam/.opam/default/lib/typerep -I /home/opam/.opam/default/lib/unboxed -I /home/opam/.opam/default/lib/unboxed/bin_prot_unboxed_numbers -I /home/opam/.opam/default/lib/unboxed/float32 -I /home/opam/.opam/default/lib/unboxed/float32_u -I /home/opam/.opam/default/lib/unboxed/float_u -I /home/opam/.opam/default/lib/unboxed/int32_u -I /home/opam/.opam/default/lib/unboxed/int64_u -I /home/opam/.opam/default/lib/unboxed/nativeint_u -I /home/opam/.opam/default/lib/unboxed/packed_float_option -I /home/opam/.opam/default/lib/unboxed/percent_u -I /home/opam/.opam/default/lib/unique -I /home/opam/.opam/default/lib/univ_map -I /home/opam/.opam/default/lib/variantslib -I /home/opam/.opam/default/lib/vec -I ../bindings_refcounted -I ../local_iterators -I ../wrapper_types -o ocaml_to_cpp.o -c ocaml_to_cpp.cpp)
- In file included from ocaml_to_cpp.cpp:1:
- ocaml_to_cpp.h:4:10: fatal error: torch/torch.h: No such file or directory
-     4 | #include <torch/torch.h>
-       |          ^~~~~~~~~~~~~~~
- compilation terminated.
- (cd _build/default/src/wrapper && /usr/bin/gcc -O2 -fno-strict-aliasing -fwrapv -pthread -fPIC -pthread -D_FILE_OFFSET_BITS=64 -Wall -fdiagnostics-color=always -Wno-discarded-qualifiers -Wno-incompatible-pointer-types -g -I /home/opam/.opam/default/lib/ocaml -I /home/opam/.opam/default/lib/base -I /home/opam/.opam/default/lib/base/md5 -I /home/opam/.opam/default/lib/base/shadow_stdlib -I /home/opam/.opam/default/lib/base_internalhash_types -I /home/opam/.opam/default/lib/base_quickcheck -I /home/opam/.opam/default/lib/base_quickcheck/ppx_quickcheck/runtime -I /home/opam/.opam/default/lib/basement -I /home/opam/.opam/default/lib/bin_prot -I /home/opam/.opam/default/lib/bin_prot/shape -I /home/opam/.opam/default/lib/capsule -I /home/opam/.opam/default/lib/capsule0/blocking_sync -I /home/opam/.opam/default/lib/capsule0/prim -I /home/opam/.opam/default/lib/ctypes -I /home/opam/.opam/default/lib/ctypes-foreign -I /home/opam/.opam/default/lib/ctypes/stubs -I /home/opam/.opam/default/lib/fieldslib -I /home/opam/.opam/default/lib/integers -I /home/opam/.opam/default/lib/jane-street-headers -I /home/opam/.opam/default/lib/nonempty_list_type -I /home/opam/.opam/default/lib/ocaml/str -I /home/opam/.opam/default/lib/ocaml/threads -I /home/opam/.opam/default/lib/ocaml/unix -I /home/opam/.opam/default/lib/ocaml_intrinsics_kernel -I /home/opam/.opam/default/lib/parsexp -I /home/opam/.opam/default/lib/portable -I /home/opam/.opam/default/lib/portable/common -I /home/opam/.opam/default/lib/portable/kernel -I /home/opam/.opam/default/lib/ppx_assert/runtime-lib -I /home/opam/.opam/default/lib/ppx_bench/config -I /home/opam/.opam/default/lib/ppx_bench/config_types -I /home/opam/.opam/default/lib/ppx_bench/runtime-lib -I /home/opam/.opam/default/lib/ppx_compare/runtime-lib -I /home/opam/.opam/default/lib/ppx_enumerate/runtime-lib -I /home/opam/.opam/default/lib/ppx_expect/config -I /home/opam/.opam/default/lib/ppx_expect/config_types -I /home/opam/.opam/default/lib/ppx_expect/make_corrected_file -I /home/opam/.opam/default/lib/ppx_expect/make_corrected_file_kernel -I /home/opam/.opam/default/lib/ppx_expect/runtime -I /home/opam/.opam/default/lib/ppx_expect/runtime_types -I /home/opam/.opam/default/lib/ppx_fuelproof/runtime -I /home/opam/.opam/default/lib/ppx_hash/runtime-lib -I /home/opam/.opam/default/lib/ppx_here/runtime-lib -I /home/opam/.opam/default/lib/ppx_inline_test/config -I /home/opam/.opam/default/lib/ppx_inline_test/runtime-lib -I /home/opam/.opam/default/lib/ppx_log/syntax -I /home/opam/.opam/default/lib/ppx_log/types -I /home/opam/.opam/default/lib/ppx_module_timer/runtime -I /home/opam/.opam/default/lib/ppx_portable/runtime -I /home/opam/.opam/default/lib/ppx_sexp_conv/runtime-lib -I /home/opam/.opam/default/lib/ppx_stable_witness/runtime -I /home/opam/.opam/default/lib/ppx_stable_witness/stable_witness -I /home/opam/.opam/default/lib/ppx_string/runtime -I /home/opam/.opam/default/lib/ppx_string_conv/runtime -I /home/opam/.opam/default/lib/ppx_typed_fields/typed_fields_lib -I /home/opam/.opam/default/lib/ppx_typed_fields/typed_variants_lib -I /home/opam/.opam/default/lib/ppxlib/print_diff -I /home/opam/.opam/default/lib/ppxlib/stdppx -I /home/opam/.opam/default/lib/ppxlib_ast/stdppx -I /home/opam/.opam/default/lib/sexp_type -I /home/opam/.opam/default/lib/sexp_type/grammar -I /home/opam/.opam/default/lib/sexplib -I /home/opam/.opam/default/lib/sexplib0 -I /home/opam/.opam/default/lib/splittable_random -I /home/opam/.opam/default/lib/stdio -I /home/opam/.opam/default/lib/stdlib-shims -I /home/opam/.opam/default/lib/time_now -I /home/opam/.opam/default/lib/typerep -I /home/opam/.opam/default/lib/unique -I /home/opam/.opam/default/lib/variantslib -I ../bindings -I ../wrapper_types -o torch_stubs_generated.o -c torch_stubs_generated.c)
- In file included from /home/opam/.opam/default/lib/ctypes/ctypes_primitives.h:16,
-                  from /home/opam/.opam/default/lib/ctypes/ctypes_cstubs_internals.h:13,
-                  from torch_stubs_generated.c:2:
- /home/opam/.opam/default/lib/ctypes/ocaml_integers.h:37:9: warning: "Int8_val" redefined
-    37 | #define Int8_val(V) ((int8_t)(Int_val(V)))
-       |         ^~~~~~~~
- In file included from /home/opam/.opam/default/lib/ocaml/caml/custom.h:20,
-                  from torch_api.h:5,
-                  from torch_stubs_generated.c:1:
- /home/opam/.opam/default/lib/ocaml/caml/mlvalues.h:154:9: note: this is the location of the previous definition
-   154 | #define Int8_val(x)  ((int8_t) Long_val(x))
-       |         ^~~~~~~~
- /home/opam/.opam/default/lib/ctypes/ocaml_integers.h:38:9: warning: "Int16_val" redefined
-    38 | #define Int16_val(V) ((int16_t)(Int_val(V)))
-       |         ^~~~~~~~~
- /home/opam/.opam/default/lib/ocaml/caml/mlvalues.h:153:9: note: this is the location of the previous definition
-   153 | #define Int16_val(x) ((int16_t) Long_val(x))
-       |         ^~~~~~~~~
[ERROR] The compilation of torch.v0.18~preview.130.106+341 failed at "dune build -p torch -j 39".
build failed... 

=== STDERR ===

2026-10-24 10:21.35: FAILED: build torch.v0.18~preview.130.106+341
2026-10-24 10:21.35: Job failed: build failed: torch.v0.18~preview.130.106+341